{"text_format":"1","workbook":"xlsx","n_sheets":58,"sheets":["Obsah","G1","G2","G3","G4","G5","G6","G7","G8","G9","G10","G11","G12","G13","G14","G15","G16","G17","G18","G19","G20","G21","G22","G23","G24","G25","G26","G27","G28","G29","G30","G31","G32","G33","G34","G35","Príloha_G1","Príloha_G2","Príloha_G3","Príloha_G4","Príloha_G5","Príloha_G6","Príloha_G7","Príloha_G8","Príloha_G9","T1","Príloha_T1","Príloha_T2","Príloha_T3","Príloha_T4","Príloha_T5","Príloha_T6","Príloha_T7","S1","M2","M3","M4","M1"],"not_rendered":{"charts":47,"images":6,"macros":0,"external_links":0,"defined_names":1293,"comments":0,"pivot_tables":0},"unopened":[],"bounds":{"document_bytes":16777216,"sheet_cells":100000,"rows_first":2000,"rows_last":500,"rows_between":2000,"halvings":0,"cell_chars":16384,"cell_head_chars":4096},"cells_cut":0,"cells_raw":0,"read":"whole","date_system":"1900"}

{"sheet":"Obsah","index":0,"n_rows":59,"n_cols":3,"rows_kept":59,"cut":false,"hidden":false,"merged":[]}
["Index","Index grafu / tabuľky","Názov grafu / tabuľky"]
[1,{"$f":"HYPERLINK(\"#'\"&INDEX(SheetNames,A2)&\"'!A1\",INDEX(SheetNames,A2))","v":"Obsah"}]
[2,{"$f":"HYPERLINK(\"#'\"&INDEX(SheetNames,A3)&\"'!A1\",INDEX(SheetNames,A3))","v":"G1"},{"$f":"INDIRECT(\"'\" & INDEX(SheetNames,A3) & \"'!A1\")","v":"Graf 1: Zásoba dreva – hrubina bez kôry (v mil. m³)"}]
[3,{"$f":"HYPERLINK(\"#'\"&INDEX(SheetNames,A4)&\"'!A1\",INDEX(SheetNames,A4))","v":"G2"},"Graf 2: Zastúpenie drevín (2024, v %)"]
[4,{"$f":"HYPERLINK(\"#'\"&INDEX(SheetNames,A5)&\"'!A1\",INDEX(SheetNames,A5))","v":"G3"},"Graf 3: Ťažba na Slovensku (v mil. m3)"]
[5,{"$f":"HYPERLINK(\"#'\"&INDEX(SheetNames,A6)&\"'!A1\",INDEX(SheetNames,A6))","v":"G4"},"Graf 4: Veková štruktúra lesov v desaťročných vekových stupňoch  v roku 2024 (v tis. ha)"]
[6,{"$f":"HYPERLINK(\"#'\"&INDEX(SheetNames,A7)&\"'!A1\",INDEX(SheetNames,A7))","v":"G5"},"Graf 5: Dovoz jednotlivých sortimentov dreva (mil. m3)"]
[7,{"$f":"HYPERLINK(\"#'\"&INDEX(SheetNames,A8)&\"'!A1\",INDEX(SheetNames,A8))","v":"G6"},"Graf 6: Vývoz jednotlivých sortimentov dreva (mil. m3)"]
[8,{"$f":"HYPERLINK(\"#'\"&INDEX(SheetNames,A9)&\"'!A1\",INDEX(SheetNames,A9))","v":"G7"},"Graf 7: Dodávky ihličnatého dreva od obhospodarovateľov lesa na domáci trh (2024, tis. m3)"]
[9,{"$f":"HYPERLINK(\"#'\"&INDEX(SheetNames,A10)&\"'!A1\",INDEX(SheetNames,A10))","v":"G8"},"Graf 8: Dodávky listnatého dreva od obhospodarovateľov lesa na domáci trh (2024, tis. m3)"]
[10,{"$f":"HYPERLINK(\"#'\"&INDEX(SheetNames,A11)&\"'!A1\",INDEX(SheetNames,A11))","v":"G9"},"Graf 9: Priama spotreba dreva v odvetviach Slovenského priemyslu (v mil. m3)"]
[11,{"$f":"HYPERLINK(\"#'\"&INDEX(SheetNames,A12)&\"'!A1\",INDEX(SheetNames,A12))","v":"G10"},"Graf 10: Výroba energie z OZE na Slovensku (v TWh)"]
[12,{"$f":"HYPERLINK(\"#'\"&INDEX(SheetNames,A13)&\"'!A1\",INDEX(SheetNames,A13))","v":"G11"},"Graf 11: Spotreba energie vo forme pevnej biomasy v rôznych sektoroch (v TWh)"]
[13,{"$f":"HYPERLINK(\"#'\"&INDEX(SheetNames,A14)&\"'!A1\",INDEX(SheetNames,A14))","v":"G12"},"Graf 12: Pôvod elektriny z biomasy v roku 2023 (v %)"]
[14,{"$f":"HYPERLINK(\"#'\"&INDEX(SheetNames,A15)&\"'!A1\",INDEX(SheetNames,A15))","v":"G13"},"Graf 13: Bytové jednotky podľa typu kúrenia a zdroja energie (v tisícoch)"]
[15,{"$f":"HYPERLINK(\"#'\"&INDEX(SheetNames,A16)&\"'!A1\",INDEX(SheetNames,A16))","v":"G14"},"Graf 14: Podiel množstva palív zaobstaraných domácnosťami ( kde primárny zdroj paliva je tuhé palivo) na Slovensku za rok 2022 (v %)"]
[16,{"$f":"HYPERLINK(\"#'\"&INDEX(SheetNames,A17)&\"'!A1\",INDEX(SheetNames,A17))","v":"G15"},"Graf 15: Počet podporených domácností pomocou schémy Zelená domácnostiam"]
[17,{"$f":"HYPERLINK(\"#'\"&INDEX(SheetNames,A18)&\"'!A1\",INDEX(SheetNames,A18))","v":"G16"},"Graf 16: Poskytnuté financovanie pomocou schémy Zelená domácnostiam (v mil. eur)"]
[18,{"$f":"HYPERLINK(\"#'\"&INDEX(SheetNames,A19)&\"'!A1\",INDEX(SheetNames,A19))","v":"G17"},"Graf 17: Množstvo elektriny na doplatok vyrobenej z biomasy (v GWh)"]
[19,{"$f":"HYPERLINK(\"#'\"&INDEX(SheetNames,A20)&\"'!A1\",INDEX(SheetNames,A20))","v":"G18"},"Graf 18: Celková suma doplatkov pre subjekty využívajúce drevnú biomasu (mil. eur)"]
[20,{"$f":"HYPERLINK(\"#'\"&INDEX(SheetNames,A21)&\"'!A1\",INDEX(SheetNames,A21))","v":"G19"},"Graf 19: Výmera jednodruhových porastov v rôznych stupňoch ochrany v roku 2023 (tis. ha)"]
[21,{"$f":"HYPERLINK(\"#'\"&INDEX(SheetNames,A22)&\"'!A1\",INDEX(SheetNames,A22))","v":"G20"},"Graf 20: Ťažba v národných parkoch po drevinách v roku 2023 (v tis. m3)"]
[22,{"$f":"HYPERLINK(\"#'\"&INDEX(SheetNames,A23)&\"'!A1\",INDEX(SheetNames,A23))","v":"G21"},"Graf 21: Priemerná koncentrácia PM2.5 na staniciach s dlhodobým meraním (v µg/m3)"]
[23,{"$f":"HYPERLINK(\"#'\"&INDEX(SheetNames,A24)&\"'!A1\",INDEX(SheetNames,A24))","v":"G22"},"Graf 22: Prognóza zásoby dreva do roku 2050 (v mil. m3)"]
[24,{"$f":"HYPERLINK(\"#'\"&INDEX(SheetNames,A25)&\"'!A1\",INDEX(SheetNames,A25))","v":"G23"},"Graf 22: Prognóza zásoby dreva do roku 2050 (v mil. m3)"]
[25,{"$f":"HYPERLINK(\"#'\"&INDEX(SheetNames,A26)&\"'!A1\",INDEX(SheetNames,A26))","v":"G24"},"Graf 24: Hlavné sortimenty vyťaženého dreva v referenčnom a LULUCF scenári (v mil. m3)"]
[26,{"$f":"HYPERLINK(\"#'\"&INDEX(SheetNames,A27)&\"'!A1\",INDEX(SheetNames,A27))","v":"G25"},"Graf 25: Konečná energetická spotreba biomasy podľa sektora do roku 2050 (WEM, v TWh)"]
[27,{"$f":"HYPERLINK(\"#'\"&INDEX(SheetNames,A28)&\"'!A1\",INDEX(SheetNames,A28))","v":"G26"},"Graf 26: Konečná energetická spotreba biomasy podľa sektora do roku 2050 (WAM, v TWh)"]
[28,{"$f":"HYPERLINK(\"#'\"&INDEX(SheetNames,A29)&\"'!A1\",INDEX(SheetNames,A29))","v":"G27"},"Graf 27: Spotreba biomasy v priemysle do roku 2050 (WEM, v TWh)"]
[29,{"$f":"HYPERLINK(\"#'\"&INDEX(SheetNames,A30)&\"'!A1\",INDEX(SheetNames,A30))","v":"G28"},"Graf 28: Spotreba biomasy v priemysle do roku 2050 (WAM, v TWh)"]
[30,{"$f":"HYPERLINK(\"#'\"&INDEX(SheetNames,A31)&\"'!A1\",INDEX(SheetNames,A31))","v":"G29"},{"$f":"INDIRECT(\"'\" & INDEX(SheetNames,A31) & \"'!A1\")","v":"Graf 29: Spotreba biomasy vo výrobe elektriny ( v TWh)"}]
[31,{"$f":"HYPERLINK(\"#'\"&INDEX(SheetNames,A32)&\"'!A1\",INDEX(SheetNames,A32))","v":"G30"},"Graf 30: Výroba tepla podľa palív v CZT (WAM, v TWh)"]
[32,{"$f":"HYPERLINK(\"#'\"&INDEX(SheetNames,A33)&\"'!A1\",INDEX(SheetNames,A33))","v":"G31"},"Graf 31: Odhad budúcej ťažby a spotreby dreva (v mil. m3)"]
[33,{"$f":"HYPERLINK(\"#'\"&INDEX(SheetNames,A34)&\"'!A1\",INDEX(SheetNames,A34))","v":"G32"},"Graf 32: Očakávané objemy priemyselného dreva a rôznych druhov energetickej drevnej biomasy v prognóze (v mil. m3)"]
[34,{"$f":"HYPERLINK(\"#'\"&INDEX(SheetNames,A35)&\"'!A1\",INDEX(SheetNames,A35))","v":"G33"},"Graf 33: Energetický potenciál drevných palív v roku 2020 (v TWh)"]
[35,{"$f":"HYPERLINK(\"#'\"&INDEX(SheetNames,A36)&\"'!A1\",INDEX(SheetNames,A36))","v":"G34"},"Graf 34: Porovnanie dopytu energie z biomasy na základe scenárov NECP a ponuky energie z biomasy na základe dostupnosti energetickej drevnej biomasy (v TWh)"]
[36,{"$f":"HYPERLINK(\"#'\"&INDEX(SheetNames,A37)&\"'!A1\",INDEX(SheetNames,A37))","v":"G35"},"Graf 35: Odhad potenciálneho vplyvu uplatnenia kaskádového princípu na dostupné množstvo energie v roku 2020 (v TWh)"]
[37,{"$f":"HYPERLINK(\"#'\"&INDEX(SheetNames,A38)&\"'!A1\",INDEX(SheetNames,A38))","v":"Príloha_G1"},"Príloha Graf  1: Produkcia drevných produktov na Slovensku z štatistík Eurostat (v mil. m3)"]
[38,{"$f":"HYPERLINK(\"#'\"&INDEX(SheetNames,A39)&\"'!A1\",INDEX(SheetNames,A39))","v":"Príloha_G2"},"Príloha Graf  2: Rozdiely v prognózach ťažby v scenároch NECP a súčasnej štúdie (v mil. m3)"]
[39,{"$f":"HYPERLINK(\"#'\"&INDEX(SheetNames,A40)&\"'!A1\",INDEX(SheetNames,A40))","v":"Príloha_G3"},"Príloha Graf  3: Spotreba biomasy v službách (v GWh)"]
[40,{"$f":"HYPERLINK(\"#'\"&INDEX(SheetNames,A41)&\"'!A1\",INDEX(SheetNames,A41))","v":"Príloha_G4"},"Príloha Graf  4: Spotreba biomasy v poľnohospodárstve (v GWh)"]
[41,{"$f":"HYPERLINK(\"#'\"&INDEX(SheetNames,A42)&\"'!A1\",INDEX(SheetNames,A42))","v":"Príloha_G5"},"Príloha Graf  5: Záchyty v sektore LULUCF (v kt CO2 ekv.)"]
[42,{"$f":"HYPERLINK(\"#'\"&INDEX(SheetNames,A43)&\"'!A1\",INDEX(SheetNames,A43))","v":"Príloha_G6"},"Príloha Graf  6: Emisie z LULUCF do roku 2050 v scenári WEM a WAM doplnených o scenáre vývoja emisií vplyvom prognóz výšky ťažbe v súčasnej štúdii (v Mt CO2 ekv.)"]
[43,{"$f":"HYPERLINK(\"#'\"&INDEX(SheetNames,A44)&\"'!A1\",INDEX(SheetNames,A44))","v":"Príloha_G7"},"Priloha Graf  7: Energetický potenciál drevných palív v roku 2025 pre rôzne scenáre (v TWh"]
[44,{"$f":"HYPERLINK(\"#'\"&INDEX(SheetNames,A45)&\"'!A1\",INDEX(SheetNames,A45))","v":"Príloha_G8"},"Priloha Graf  8: Porovnanie dopytu energie z biomasy na základe scenárov NECP a ponuky energie na základe základného scenáru štúdie a dvoch alternatívnych scenárov (v TWh)"]
[45,{"$f":"HYPERLINK(\"#'\"&INDEX(SheetNames,A46)&\"'!A1\",INDEX(SheetNames,A46))","v":"Príloha_G9"},"Príloha Graf  9: Prehľad štatistických výkazov v drevárskom sektore"]
[46,{"$f":"HYPERLINK(\"#'\"&INDEX(SheetNames,A47)&\"'!A1\",INDEX(SheetNames,A47))","v":"T1"},"Tabuľka 1: Scenáre výpočtu rastu a ťažby dreva v lesoch v horizonte do roku 2050"]
[47,{"$f":"HYPERLINK(\"#'\"&INDEX(SheetNames,A48)&\"'!A1\",INDEX(SheetNames,A48))","v":"Príloha_T1"},"Tabuľka 1: Rozpis zdrojov informácií ku Schéme 1 v hlavnom texte"]
[48,{"$f":"HYPERLINK(\"#'\"&INDEX(SheetNames,A49)&\"'!A1\",INDEX(SheetNames,A49))","v":"Príloha_T2"},"Tabuľka 2: Zhrnutie simulácií v modeli SIBYLA"]
[49,{"$f":"HYPERLINK(\"#'\"&INDEX(SheetNames,A50)&\"'!A1\",INDEX(SheetNames,A50))","v":"Príloha_T3"},"Tabuľka 3: Výška ťažby zadávaná do modelu"]
[50,{"$f":"HYPERLINK(\"#'\"&INDEX(SheetNames,A51)&\"'!A1\",INDEX(SheetNames,A51))","v":"Príloha_T4"},"Tabuľka 4: Opatrenia týkajúce sa biomasy v scenári s dodatočnými opatreniami (WAM)"]
[51,{"$f":"HYPERLINK(\"#'\"&INDEX(SheetNames,A52)&\"'!A1\",INDEX(SheetNames,A52))","v":"Príloha_T5"},"Tabuľka 5: Prehľad štatistických výkazov v drevárskom sektore"]
[52,{"$f":"HYPERLINK(\"#'\"&INDEX(SheetNames,A53)&\"'!A1\",INDEX(SheetNames,A53))","v":"Príloha_T6"},"Tabuľka 6: Sortimenty dreva a ich využitie"]
[53,{"$f":"HYPERLINK(\"#'\"&INDEX(SheetNames,A54)&\"'!A1\",INDEX(SheetNames,A54))","v":"Príloha_T7"},"Tabuľka 7: Vývoj cien sortimentov dreva"]
[54,{"$f":"HYPERLINK(\"#'\"&INDEX(SheetNames,A55)&\"'!A1\",INDEX(SheetNames,A55))","v":"S1"},"Schéma 1: Odhadované využívanie drevnej biomasy (2020, v mil. m3)"]
[55,{"$f":"HYPERLINK(\"#'\"&INDEX(SheetNames,A56)&\"'!A1\",INDEX(SheetNames,A56))","v":"M1"},"Mapa 2: Smrekové porasty podľa nadmorskej výšky (2023)"]
[56,{"$f":"HYPERLINK(\"#'\"&INDEX(SheetNames,A57)&\"'!A1\",INDEX(SheetNames,A57))","v":"M2"},"Mapa 3 : Stav lesov podľa stupňa defoliácie (satelitné dáta) (2023)"]
[57,{"$f":"HYPERLINK(\"#'\"&INDEX(SheetNames,A58)&\"'!A1\",INDEX(SheetNames,A58))","v":"M3"},"Mapa 4 : Priemerná ročná koncentrácia PM2.5  v roku 2024 – modelované hodnoty"]
[58,{"$f":"HYPERLINK(\"#'\"&INDEX(SheetNames,A59)&\"'!A1\",INDEX(SheetNames,A59))","v":"M4"},"Mapa 1: Výskyt jednodruhových porastov (2023)"]

{"sheet":"G1","index":1,"n_rows":6,"n_cols":12,"rows_kept":6,"cut":false,"hidden":false,"merged":[]}
["Graf 1: Zásoba dreva – hrubina bez kôry (v mil. m³)"]
[null,1980,1990,2000,2005,2010,2015,2020,2021,2022,2023,2024]
["Spolu (mil. m³)",324,348.5,410,438.9,461.9,478.1,484.5,487.3,482.8,487.1,488.5]
["Ihličnaté stromy",170,178.9,199.1,207.4,212.2,202.2,194.8,194.5,191.4,192,190.5]
["Listnaté stromy",154,169.6,210.9,231.6,249.8,275.89999999999998,289.7,292.8,291.39999999999998,295.10000000000002,298]
["na 1 ha (m³)",174,181,215,229,239,247,249,250,248,250,250]

{"sheet":"G2","index":2,"n_rows":8,"n_cols":2,"rows_kept":8,"cut":false,"hidden":false,"merged":[]}
["Graf 2: Zastúpenie drevín (2024, v %)"]
["Buk",35.799999999999997]
["Dub",10.199999999999999]
["Hrab",6]
["Ostatné listnaté stromy",13]
["Smrek",20.9]
["Borovica",6.4]
["Ostatné ihličnaté stromy",{"$f":"4+2.6+1.1","v":7.6999999999999993}]

{"sheet":"G3","index":3,"n_rows":6,"n_cols":26,"rows_kept":6,"cut":false,"hidden":false,"merged":[]}
["Graf 3: Ťažba na Slovensku (v mil. m3)"]
[null,2000,2001,2002,2003,2004,2005,2006,2007,2008,2009,2010,2011,2012,2013,2014,2015,2016,2017,2018,2019,2020,2021,2022,2023,2024]
["Plánovaná únosná",5.3259999999999996,5.6180000000000003,5.9139999999999997,6.1970000000000001,6.5389999999999997,6.8209999999999997,7.0410000000000004,7.2279999999999998,7.5220000000000002,7.83,8.2189999999999994,8.5090000000000003,8.8710000000000004,9.1180000000000003,9.3490000000000002,9.5239999999999991,9.6910000000000007,9.7479999999999993,9.8859999999999992,9.9420000000000002,9.8480000000000008,9.7420000000000009,9.6839999999999993,9.5329999999999995,9.3970000000000002]
["Vykonaná úmyselná",3.1970000000000001,3.742,4.09,3.9750000000000001,4.3520000000000003,3.657,4.0910000000000002,3.6659999999999999,3.3519999999999999,3.6619999999999999,3.7010000000000001,4.4749999999999996,4.7279999999999998,4.7270000000000003,3.2749999999999999,4.0350000000000001,4.6319999999999997,4.4530000000000003,4.141,4.0650000000000004,3.976,4.7229999999999999,4.9320000000000004,3.7160000000000002,4.0780000000000003]
["Vykonaná náhodná (kalamitná)",3.0209999999999999,2.4420000000000002,2.1579999999999999,2.677,2.9159999999999999,6.5330000000000004,4.266,4.7009999999999996,6.1150000000000002,5.5860000000000003,6.1589999999999998,4.992,3.504,3.11,6.1420000000000003,5.2130000000000001,4.6900000000000004,4.9409999999999998,5.7240000000000002,5.1539999999999999,3.5339999999999998,2.9180000000000001,2.7549999999999999,3.5070000000000001,4.5670000000000002]
["Celkový bežný prírastok",11.204000000000001,11.298999999999999,11.391,11.452,11.534000000000001,11.584,11.670999999999999,11.664999999999999,11.768000000000001,11.866,11.952999999999999,12.023999999999999,12.125999999999999,11.981999999999999,12.079000000000001,12.092000000000001,12.079000000000001,12.023,12.007,11.98,11.974,11.984,11.992000000000001,11.882,11.885]

{"sheet":"G4","index":4,"n_rows":6,"n_cols":16,"rows_kept":6,"cut":false,"hidden":false,"merged":[]}
["Graf 4: Veková štruktúra lesov v desaťročných vekových stupňoch  v roku 2024 (v tis. ha)"]
["Vekový stupeň",1,2,3,4,5,6,7,8,9,10,11,12,13,14,"15+"]
["Smrek",57.2,46.2,30.4,30.4,37.700000000000003,33.200000000000003,24.5,23.1,26.7,21.9,18.8,18.100000000000001,12.2,6.7,19.899999999999999]
["Buk",68.599999999999994,83.8,46.2,39.4,48.9,42.3,38.299999999999997,46,57.4,51.2,47.1,43.8,30.4,17.399999999999999,37]
["Dub",14.9,8.1,6.5,7.5,10.8,9,7.8,21.8,38.299999999999997,37.299999999999997,29.5,24.1,16.3,9.4,9.5]
["Ostatné",44.399999999999991,66.099999999999994,51.099999999999994,45.8,56.900000000000006,49.1,42.6,41.1,42.9,36.099999999999994,33.1,28.599999999999998,14.9,8.4,20.5]

{"sheet":"G5","index":5,"n_rows":9,"n_cols":13,"rows_kept":9,"cut":false,"hidden":false,"merged":[]}
["Graf 5: Dovoz jednotlivých sortimentov dreva (mil. m3)"]
["Dovoz (tis. m3)",2013,2014,2015,2016,2017,2018,2019,2020,2021,2022,2023,2024]
["Ihličnaté výrezy (I. - III.)",78,91,11,87,159,305,414,898,1049,1130,373,175]
["Ihličnaté drevo (IV. - V.)",64,94,36,27,55,152,256,575,645,705,256,97]
["Listnaté výrezy (I. - III.)",105,118,85,68,307,436,601,381,562,870,579,787]
["Listnaté drevo (IV. - V.)",549,588,380,357,299,319,263,70,91,53,54,76]
["Palivové drevo (VI.)",126,129,37,37,107,183,87,76,107,83,74,22]
["Celkový dovoz",922,1020,549,576,927,1395,1621,2000,2454,2841,1336,1157]
["Celkový vývoz",3122,3408,2687,2449,2016,2099,1750,2290,2064,1888,1839,2649]

{"sheet":"G6","index":6,"n_rows":9,"n_cols":13,"rows_kept":9,"cut":false,"hidden":false,"merged":[]}
["Graf 6: Vývoz jednotlivých sortimentov dreva (mil. m3)"]
["Vývoz (tis. m3)",2013,2014,2015,2016,2017,2018,2019,2020,2021,2022,2023,2024]
["Ihličnaté výrezy (I.-III.)",1444,1624,1142,1029,903,860,575,769,716,512,621,940]
["Ihličnaté drevo (IV.-V.)",525,614,564,373,442,632,812,1030,730,766,571,877]
["Listnaté výrezy (I.-III.)",238,278,306,307,456,468,253,310,423,479,451,427]
["Listnaté drevo (IV.-V.)",455,433,391,448,154,81,71,110,147,107,108,346]
["Palivové drevo (VI.)",460,459,284,292,61,58,39,71,48,24,88,59]
["Celkový vývoz",3122,3408,2687,2449,2016,2099,1750,2290,2064,1888,1839,2649]
["Celkový dovoz",922,1020,549,576,927,1395,1621,2000,2454,2841,1336,1157]

{"sheet":"G7","index":7,"n_rows":10,"n_cols":2,"rows_kept":10,"cut":false,"hidden":false,"merged":[]}
["Graf 7: Dodávky ihličnatého dreva od obhospodarovateľov lesa na domáci trh (2024, tis. m3)"]
[null,"Dodávky na domáci trh"]
["I. a II. trieda",3.1]
["III. trieda",3037]
["IV. trieda ",58]
["V. trieda (vlákninové)",1081]
["VI. trieda (palivové)",181]
["Drevo na energetické účely",27]
["Drevo na pni",91]
["Surové kmene",414]

{"sheet":"G8","index":8,"n_rows":10,"n_cols":2,"rows_kept":10,"cut":false,"hidden":false,"merged":[]}
["Graf 8: Dodávky listnatého dreva od obhospodarovateľov lesa na domáci trh (2024, tis. m3)"]
[null,"Dodávky na domáci trh"]
["I. a II. trieda",23]
["III. trieda",567]
["IV. trieda ",2]
["V. trieda (vlákninové)",2303]
["VI. trieda (palivové)",194]
["Drevo na energetické účely",43.85]
["Drevo na pni",25]
["Surové kmene",12]

{"sheet":"G9","index":9,"n_rows":6,"n_cols":12,"rows_kept":6,"cut":false,"hidden":false,"merged":[]}
["Graf 9: Priama spotreba dreva v odvetviach Slovenského priemyslu (v mil. m3)"]
[null,2014,2015,2016,2017,2018,2019,2020,2021,2022,2023,2024]
["Papierensky",2.4940000000000002,2.4359999999999999,2.2810000000000001,2.2919999999999998,2.6749999999999998,2.35,2.3570000000000002,2.1970000000000001,2.6110000000000002,2.0750000000000002]
["Píli",3.3078685934291578,3.2396985831622178,3.2559295379876794,3.5789255390143735,3.5578252977412732,3.4344700410677618,3.1619999999999999,3.3792847946611908,3.5107555287474335,2.7933473254620123]
["Domácnosti",0.97713140657084208,1.1803014168377821,1.8570704620123206,2.4000744609856266,2.666174702258727,3.0465299589322381,1.6379999999999999,2.477715205338809,2.2662444712525667,1.7296526745379879]
["Celková spotreba",6.7789999999999999,6.8559999999999999,7.3940000000000001,8.2710000000000008,8.8990000000000009,8.8309999999999995,7.157,8.0540000000000003,8.3879999999999999,6.5980000000000008,7.0439999999999996]

{"sheet":"G10","index":10,"n_rows":8,"n_cols":15,"rows_kept":8,"cut":false,"hidden":false,"merged":[]}
["Graf 10: Výroba energie z OZE na Slovensku (v TWh)"]
[null,2010,2011,2012,2013,2014,2015,2016,2017,2018,2019,2020,2021,2022,2023]
["Pevná biomasa",14.990167,14.577833,15.186221999999999,14.126723,10.846278,14.469278000000001,14.756777999999999,14.598333,13.498610999999999,14.121945,13.054167,15.003611000000001,13.603999999999999,13.558999999999999]
["Vodná",5.2549999999999999,3.778187,4.1029999999999998,4.8479999999999999,4.2089999999999996,3.8660000000000001,4.359,4.3239999999999998,3.59,4.3559999999999999,4.5170000000000003,4.258,3.6779999999999999,4.6859999999999999]
["Bioplyny",0.11594400000000001,0.37716700000000003,0.44805499999999993,0.30883299999999997,0.61427799999999999,1.1304450000000001,1.082389,1.118444,1.0501109999999998,0.96261099999999999,0.99055499999999996,0.98311099999999996,0.75211200000000011,0.83199999999999996]
["Solárna elektrina",1.6941999999999999E-2,0.39700000000000002,0.42399999999999999,0.58799999999999997,0.59699999999999998,0.50600000000000001,0.53300000000000003,0.50600000000000001,0.58499999999999996,0.58899999999999997,0.66300000000000003,0.67100000000000004,0.65,0.60499999999999998]
["Zelené zložky KO",0.13422200000000001,7.5943999999999998E-2,7.5332999999999997E-2,6.9889000000000007E-2,2.1999999999999999E-2,2.1999999999999999E-2,1.7222000000000001E-2,0.16727699999999998,5.4611E-2,0.19844399999999998,0.20272200000000001,0.30394399999999994,0.19749999999999998,0.25900000000000001]
["Ostatné",0.11377699999999999,0.10972299999999999,0.10989,0.11849999999999999,0.122111,0.11877799999999999,0.128222,0.14044499999999999,0.14933399999999999,0.15905599999999998,0.155945,0.151111,0.16677799999999998,0.17100000000000001]

{"sheet":"G11","index":11,"n_rows":5,"n_cols":15,"rows_kept":5,"cut":false,"hidden":false,"merged":[]}
["Graf 11: Spotreba energie vo forme pevnej biomasy v rôznych sektoroch (v TWh)"]
[null,2010,2011,2012,2013,2014,2015,2016,2017,2018,2019,2020,2021,2022,2023]
["Priemysel",4.3658329999999994,4.2752780000000001,3.1522220000000001,2.8883330000000003,3.7580559999999998,4.7374999999999998,3.9750000000000001,4.0658330000000005,4.5413890000000006,4.6958329999999995,3.4822220000000002,3.8250000000000002,3.8497220000000003,3.5579999999999998]
["Domácnosti",8.891667,8.4405560000000008,9.3030559999999998,8.5983330000000002,4.8522219999999994,7.2516670000000003,8.1938889999999986,7.91,6.4725000000000001,6.8305559999999996,6.9519440000000001,8.0808330000000002,7.0863890000000005,5.2759999999999998]
["Energetika",3.4708330000000003,3.9152779999999998,5.4152779999999998,5.4291670000000005,4.4619440000000008,5.0372219999999999,5.0894440000000003,5.0338890000000003,5.0013890000000005,4.5516670000000001,4.8341670000000008,5.3505559999999992,4.8969440000000004,4.6180000000000003]

{"sheet":"G12","index":12,"n_rows":5,"n_cols":2,"rows_kept":5,"cut":false,"hidden":false,"merged":[]}
["Graf 12: Pôvod elektriny z biomasy v roku 2023 (v %)"]
["KVET - priemysel",0.63759086188992731]
["KVET - energetika",0.18865435356200527]
["Produkcia elektriny - energetika",9.6091205211726385E-2]
["Produkcia elektriny - priemysel",1.3986013986013986E-2]

{"sheet":"G13","index":13,"n_rows":7,"n_cols":7,"rows_kept":7,"cut":false,"hidden":false,"merged":[]}
["Graf 13: Bytové jednotky podľa typu kúrenia a zdroja energie (v tisícoch)"]
[null,"Plyn","Pevné palivo","Elektrina","Iný/žiadny/nezistený","Solárna energia","Kvapalné palivo"]
["iné/nezistené/bez kúrenia",8.4190000000000005,9.42,7.843,57.276000000000003,0.443,4.9000000000000002E-2]
["etážové",71.489000000000004,9.4629999999999992,10.231,0.58599999999999997,3.7999999999999999E-2,3.6999999999999998E-2]
["samostatné vykurovacie teleso",119.846,169.5,24.463000000000001,2.262,0.182,0.495]
["ústredné diaľkové",542.80999999999995,120.733,3.8220000000000001,103.521,3.9E-2,1.9039999999999999]
["ústredné lokálne",737.90800000000002,167.505,53.777000000000001,9.8119999999999994,0.52300000000000002,1.19]

{"sheet":"G14","index":14,"n_rows":8,"n_cols":2,"rows_kept":8,"cut":false,"hidden":false,"merged":[]}
["Graf 14: Podiel množstva palív zaobstaraných domácnosťami ( kde primárny zdroj paliva je tuhé palivo) na Slovensku za rok 2022 (v %)"]
["Palivové drevo",0.78200000000000003]
["Čierne uhlie",7.5999999999999998E-2]
["Brikety uhoľné",4.7E-2]
["Drevené pelety",3.7999999999999999E-2]
["Brikety drevené",2.6000000000000002E-2]
["Hnedé uhlie",1.6E-2]
["Iné",1.3999999999999999E-2]

{"sheet":"G15","index":15,"n_rows":6,"n_cols":9,"rows_kept":6,"cut":false,"hidden":false,"merged":[]}
["Graf 15: Počet podporených domácností pomocou schémy Zelená domácnostiam"]
[null,2016,2017,2018,2019,2020,2021,2022,2023]
["kotol na biomasu",332,984,1297,751,915,1072,1025,668]
["fotovoltický panel",1071,1520,1085,992,1142,1225,2596,7370]
["slnečný kolektor",1513,3029,2434,1770,1712,1551,1433,1079]
["tepelné čerpadlo",891,1951,2400,1398,2163,2019,3671,6225]

{"sheet":"G16","index":16,"n_rows":6,"n_cols":9,"rows_kept":6,"cut":false,"hidden":false,"merged":[]}
["Graf 16: Poskytnuté financovanie pomocou schémy Zelená domácnostiam (v mil. eur)"]
[null,2016,2017,2018,2019,2020,2021,2022,2023]
["tepelné čerpadlo",2.5967790000000002,5.7737379999999998,7.1688669999999997,4.1067070000000001,6.4545690000000002,5.8865499999999997,10.579234,17.931239999999999]
["fotovoltický panel",2.7553359999999998,4.5941070000000002,3.0569609999999998,1.3744449999999999,1.6386510000000001,1.7826489999999999,3.8415319999999999,10.989089]
["slnečný kolektor",2.3643100000000001,4.8500769999999997,3.9752200000000002,2.8789060000000002,2.8127849999999999,2.5448409999999999,2.3170440000000001,1.7350570000000001]
["kotol na biomasu",0.49419600000000002,1.461222,1.929878,1.1071820000000001,1.3531280000000001,1.5764499999999999,1.5199419999999999,0.98446900000000004]

{"sheet":"G17","index":17,"n_rows":3,"n_cols":14,"rows_kept":3,"cut":false,"hidden":false,"merged":[]}
["Graf 17: Množstvo elektriny na doplatok vyrobenej z biomasy (v GWh)"]
[null,2011,2012,2013,2014,2015,2016,2017,2018,2019,2020,2021,2022,2023]
["Množstvo elektriny na doplatok vyrobenej z biomasy",329,449,447,605,658,675,698,735,737,648,483,380,281]

{"sheet":"G18","index":18,"n_rows":3,"n_cols":14,"rows_kept":3,"cut":false,"hidden":false,"merged":[]}
["Graf 18: Celková suma doplatkov pre subjekty využívajúce drevnú biomasu (mil. eur)"]
[null,2011,2012,2013,2014,2015,2016,2017,2018,2019,2020,2021,2022,2023]
["Celková suma doplatkov pre subjekty využívajúce drevnú biomasu",23,29,33,48,54,63,70,70,64,70,23,0,6]

{"sheet":"G19","index":19,"n_rows":5,"n_cols":6,"rows_kept":5,"cut":false,"hidden":false,"merged":[]}
["Graf 19: Výmera jednodruhových porastov v rôznych stupňoch ochrany v roku 2023 (tis. ha)"]
[null,"5. stupeň ochrany","4. stupeň ochrany","3. stupeň ochrany","2. stupeň ochrany","1. stupeň ochrany"]
["Jednodruhové porasty",19.364000000000001,3.4849999999999999,49.639000000000003,118.20399999999999,215.14]
["Lesy celkovo",74.260000000000005,20.437999999999999,233.82599999999999,548.81799999999998,1078.1510000000001]
["Podiel jednodruhových porastov",{"$f":"B3/B4","v":0.26075949367088608},{"$f":"C3/C4","v":0.17051570603777277},{"$f":"D3/D4","v":0.21229033554865587},{"$f":"E3/E4","v":0.21537923318841581},{"$f":"F3/F4","v":0.19954533270386057}]

{"sheet":"G20","index":20,"n_rows":11,"n_cols":4,"rows_kept":11,"cut":false,"hidden":false,"merged":[]}
["Graf 20: Ťažba v národných parkoch po drevinách v roku 2023 (v tis. m3)"]
[null,"Smrek","Buk","Ostatné"]
["Nízke Tatry",246.54499999999999,3.9159999999999999,4.6420000000000003]
["Vysoké Tatry",121.962,0.14799999999999999,0.77900000000000003]
["Muráňska Planina",62.302,0.84099999999999997,1.49]
["Malá Fatra",48.127000000000002,10.744,1.1850000000000001]
["Veľká fatra",38.866,8.6910000000000007,2.9420000000000002]
["Slovenský Raj",15.56,1.639,1.8360000000000001]
["Slovenský kras",3.3719999999999999,15.137,14.728999999999999]
["Pieniny",0.42199999999999999,0.14499999999999999,0.39400000000000002]
["Poloniny",0.152,25.831,4.4630000000000001]

{"sheet":"G21","index":21,"n_rows":4,"n_cols":16,"rows_kept":4,"cut":false,"hidden":false,"merged":[]}
["Graf 21: Priemerná koncentrácia PM2.5 na staniciach s dlhodobým meraním (v µg/m3)"]
[null,2010,2011,2012,2013,2014,2015,2016,2017,2018,2019,2020,2021,2022,2023,2024]
["Priemerná koncentrácia na meracích staniciach",21.671197763418341,27.155914285714289,22.61962307692308,18.95008076923077,19.681939285714286,18.688356785714284,16.171384999999997,18.702706451612904,18.002687741935482,15.4668525,14.871308000000006,17.048053777777781,14.712254782608699,13.706812765957444,14.114681186774428]
["Nový limit pre PM2.5",10,10,10,10,10,10,10,10,10,10,10,10,10,10,10]

{"sheet":"G22","index":22,"n_rows":6,"n_cols":47,"rows_kept":6,"cut":false,"hidden":false,"merged":[]}
["Graf 22: Prognóza zásoby dreva do roku 2050 (v mil. m3)"]
[null,2005,2006,2007,2008,2009,2010,2011,2012,2013,2014,2015,2016,2017,2018,2019,2020,2021,2022,2023,2024,2025,2026,2027,2028,2029,2030,2031,2032,2033,2034,2035,2036,2037,2038,2039,2040,2041,2042,2043,2044,2045,2046,2047,2048,2049,2050]
["Zásoba dreva",438.9,443.5,448.1,452.70000000000005,457.30000000000007,461.9,465.14,468.38,471.62,474.86,478.1,479.34000000000003,480.58000000000004,481.82000000000005,483.06000000000006,484.3,487.3,482.8,487.1]
["Scenár LULUCF",null,null,null,null,null,null,null,null,null,null,null,null,null,null,null,null,null,null,483.95658476089761,483.98555565981638,485.24606158165653,486.89559898231784,487.29768948102566,489.19046227113387,491.61871119370772,493.34948742248304,494.64241525366924,495.8790820007261,497.65577388602514,501.17185833697295,504.45723383353334,508.84007064172437,511.3303302004262,513.63167116227407,516.84064718594391,519.6731687540082,523.64741319821678,525.53231353672584,527.47630336659074,530.57467304288082,533.74016389860083,537.48550576693503,539.00902814420067,540.59072077755252,543.62938979244802,546.61883233841911]
["Bezzásahový scenár",null,null,null,null,null,null,null,null,null,null,null,null,null,null,null,null,null,null,483.95682630245398,483.5704585358713,484.02541278480697,484.47725622495955,483.68449316541438,484.47271532685062,485.72952023212321,486.16229594521491,486.16467395121634,486.20996283623157,486.91156490196698,489.14624700110897,491.05632467881691,494.00654032860899,495.1684939910304,496.12507783538484,497.97745505714806,499.45123249317231,502.08083310797883,502.67547844359052,503.28479103757428,504.94555387936902,506.63878865410123,508.90972305257856,509.0460253815636,509.25320682534721,510.78348649609171,512.25606232221537]
["Referenčný scenár",null,null,null,null,null,null,null,null,null,null,null,null,null,null,null,null,null,null,483.89853837629704,483.3093483120353,483.41353850203478,483.41920339431016,482.11895984176471,482.31056699402626,483.00592652148515,482.97106317051384,482.55851504070262,482.11687137272446,482.25105825311471,483.88495171410301,485.18308366791848,487.48935684252109,488.00292256866493,488.29704519851856,489.44546685029735,490.20191076973782,492.06390306600161,491.9034568421992,491.7375011365138,492.57393738460041,493.41645450647565,494.79341425024677,494.06329163957088,493.37337960799749,493.93136221292622,494.4795492341961]

{"sheet":"G23","index":23,"n_rows":11,"n_cols":42,"rows_kept":11,"cut":false,"hidden":false,"merged":[]}
["Graf 22: Prognóza zásoby dreva do roku 2050 (v mil. m3)"]
[null,2010,2011,2012,2013,2014,2015,2016,2017,2018,2019,2020,2021,2022,2023,2024,2025,2026,2027,2028,2029,2030,2031,2032,2033,2034,2035,2036,2037,2038,2039,2040,2041,2042,2043,2044,2045,2046,2047,2048,2049,2050]
["Plán ťažby",8.2189999999999994,8.5090000000000003,8.8710000000000004,9.1180000000000003,9.3490000000000002,9.5239999999999991,9.6910000000000007,9.7479999999999993,9.8859999999999992,9.9420000000000002,9.8480000000000008,9.7420000000000009,9.6839999999999993,9.5329999999999995]
["Vykonaná ťažba",9.86,9.4670000000000005,8.2319999999999993,7.8369999999999997,9.4169999999999998,9.2479999999999993,9.3219999999999992,9.3940000000000001,9.8650000000000002,9.2189999999999994,7.51,7.641,7.6870000000000003,7.2229999999999999]
["Celkový bežný prírastok",11.952999999999999,12.023999999999999,12.125999999999999,11.981999999999999,12.079000000000001,12.092000000000001,12.079000000000001,12.023,12.007,11.98,11.974,11.984,11.992000000000001,11.882]
["Ťažba - Scenár LULUCF",null,null,null,null,null,null,null,null,null,null,null,null,null,null,7.5477244332562474,7.526999952754629,7.6729781772587895,7.5920233021361812,7.5201997769576217,7.4824366943838028,7.5082249833691392,7.5873478746773513,7.6400762721776871,7.6093036467008242,7.5254301997011028,7.4570566316518931,7.4661386887118963,7.5503080872898209,7.5340412326337987,7.5718845557201409,7.5238653640285698,7.5751336582392419,7.5208596078338674,7.4604483759973546,7.4112813702914861,7.3801368952176807,7.4154007496373389,7.3666883323733812,7.3711268221297281,7.3474541846578827,7.3593955300249219]
["Ťažba - Bezzásahový scenár",null,null,null,null,null,null,null,null,null,null,null,null,null,null,9.0215521581328986,8.9307302974652565,8.9069273907337205,8.8098448978088477,8.7363091304587428,8.6636133311856849,8.6618941375122933,8.6247165038642439,8.6574594054050262,8.6259048755682155,8.661127253676824,8.6595485016918907,8.6626865342118595,8.643146104016207,8.6065718312840218,8.5822289719089611,8.5389337867266963,8.5143677204982815,8.4695426335759549,8.428434741360519,8.3971557605835621,8.3743983797052444,8.3609386087263946,8.319199643566396,8.2848179602577439,8.2850734628908231,8.2525765384120362]
["Ťažba - Referenčný scenár",null,null,null,null,null,null,null,null,null,null,null,null,null,null,9.5559252782889086,9.4196873155420384,9.3436583498949233,9.2528167668565793,9.1842502043519829,9.1166948277127862,9.1232665000833268,9.0921653720647981,9.1323502801404626,9.1031633594595274,9.1451747940708472,9.1480916462436674,9.1586287344204127,9.145811706349523,9.1160634882200551,9.1016970672635527,9.0667121891514242,9.052020779129327,9.0127999221648807,8.9791775718089628,8.956939299319906,8.9454255279694266,8.9438945226185158,8.9118485791791748,8.8871345611242347,8.899188793503976,8.8777352196217496]
["Prírastok - Referenčný scenár",null,null,null,null,null,null,null,null,null,null,null,null,null,null,11.829411,11.776821999999999,11.724233,11.671644000000001,11.619054999999999,11.566466,11.513877000000001,11.461288,11.408699,11.356110000000001,11.303521,11.250932000000001,11.198343000000001,11.145754,11.093165000000001,11.040576000000001,10.987987,10.935398000000001,10.882809000000002,10.830220000000001,10.777631000000001,10.725042000000002,10.672453000000001,10.619864000000002,10.567275000000002,10.514686000000001,10.462097000000002]
["Prírastok - Bezzásahový scenár",null,null,null,null,null,null,null,null,null,null,null,null,null,null,11.84943,11.81686,11.78429,11.751720000000001,11.719150000000001,11.686580000000001,11.654010000000001,11.621440000000002,11.588870000000002,11.556300000000004,11.523730000000004,11.491160000000004,11.458590000000004,11.426020000000005,11.393450000000005,11.360880000000005,11.328310000000005,11.295740000000006,11.263170000000006,11.230600000000006,11.198030000000006,11.165460000000007,11.132890000000007,11.100320000000007,11.067750000000007,11.035180000000008,11.002610000000008]
["Prírastok - Scenár LULUCF",null,null,null,null,null,null,null,null,null,null,null,null,null,null,11.90363,11.925259999999998,11.946889999999998,11.968519999999996,11.990149999999996,12.011779999999995,12.033409999999995,12.055039999999993,12.076669999999993,12.098299999999991,12.119929999999991,12.141559999999991,12.16318999999999,12.18481999999999,12.206449999999988,12.228079999999988,12.249709999999986,12.271339999999986,12.292969999999984,12.314599999999984,12.336229999999983,12.357859999999983,12.379489999999981,12.401119999999981,12.422749999999979,12.444379999999979,12.466009999999978]

{"sheet":"G24","index":24,"n_rows":45,"n_cols":7,"rows_kept":45,"cut":false,"hidden":false,"merged":[]}
["Graf 24: Hlavné sortimenty vyťaženého dreva v referenčnom a LULUCF scenári (v mil. m3)"]
[null,"III. trieda kvality - Referenčný scenár","V. trieda kvality - Referenčný scenár","III. trieda kvality - Scenár LULUCF","V. trieda kvality - Scenár LULUCF"]
[2024,5.5919188615210196,3.0087584495768303,4.6866226291554174,2.364220916934856]
[2025,5.5384828155002088,2.9850341768909283,4.6516574778951538,2.3551840167106408]
[2026,5.5285743779278267,2.984094477379478,4.6478934279800921,2.3595392627627088]
[2027,5.460980227411377,2.9749985662948495,4.5877900680860773,2.3490150507402854]
[2028,5.3954187030082323,2.9788431532002861,4.5340481908743167,2.3434735615223174]
[2029,5.3143824377537392,2.9945387743422551,4.4883874036189253,2.3534519358135326]
[2030,5.2805845001505443,3.0316616210242402,4.4856451741755885,2.3859946059465922]
[2031,5.2228754144666611,3.0644266165945417,4.5091983280981633,2.4337523433827615]
[2032,5.2144969716827791,3.1118237106364721,4.5274303337219131,2.4742309703288003]
[2033,5.1616056876746974,3.1405939566861276,4.4911377000686539,2.4887124031387273]
[2034,5.1552352997709274,3.1879392017507668,4.4157484360780197,2.4929932352484276]
[2035,5.1274729365018921,3.2198636456274987,4.3494625632610164,2.4982707781816105]
[2036,5.109105316395615,3.2500691561093729,4.3257472344388264,2.5193920843320083]
[2037,5.0841647681499484,3.2642368285596746,4.3538098962614731,2.55039973625962]
[2038,5.0492484785177671,3.2722941901061673,4.3150431395418689,2.5506507127119038]
[2039,5.0284770817542963,3.2832641929630357,4.3197679843228149,2.5721458826423196]
[2040,4.9907836722865202,3.2905100650495229,4.2786635604237793,2.5692212668809389]
[2041,4.9717534077749113,3.2999360779048685,4.3073959520161385,2.5887443722219166]
[2042,4.9465376928881719,3.2907757354268248,4.2779961773160586,2.569246038980467]
[2043,4.9298669434881948,3.2755136976751116,4.2432330431346985,2.5472982346180895]
[2044,4.9228961835509732,3.261335960450499,4.2149921540089439,2.5305030244036875]
[2045,4.9219179176577805,3.2466339875492602,4.19525842083622,2.5175174374765628]
[2046,4.9335012009477159,3.2324309300006795,4.226854908702018,2.5154202722074355]
[2047,4.9296296122790944,3.2046619476411413,4.2088579615836652,2.4849201804792242]
[2048,4.925418100322009,3.1811201510904032,4.2258913570613892,2.46494873503375]
[2049,4.9414430214283014,3.1724149704386995,4.223215203383381,2.4421203684475432]
[2050,4.9463239999999997,3.1538600000000003,4.2205389999999996,2.42]
[]
[]
[]
[]
[]
[]
[]
[]
[]
[]
[]
[]
[]
[]
[]
[null,null,null,null,null,null,1000]

{"sheet":"G25","index":25,"n_rows":8,"n_cols":9,"rows_kept":8,"cut":false,"hidden":false,"merged":[]}
["Graf 25: Konečná energetická spotreba biomasy podľa sektora do roku 2050 (WEM, v TWh)"]
[null,2019,2020,2025,2030,2035,2040,2045,2050]
["Domácnosti",6.7524710400000005,6.7774897566578591,7.0219000715366429,6.9400147700077754,6.086357577160058,5.3125735359428354,4.5528971869188277,3.758181219979869]
["Priemysel",6.5353040499999997,2.8650392483629847,6.7631392535498005,5.7104265657808977,6.9906987252670802,6.9426281073630909,6.9201576228093415,6.861661680485744]
["Poľnohospodárstvo",9.333074999999999E-2,7.1669344676138808E-2,0.12420904971831401,0.11502756566103599,0.109801038476083,0.11256817613546499,0.11676910997114,0.11989041573732599]
["Služby",5.9440930000000003E-2,2.8921637725416598E-2,8.82099137576422E-2,9.7351413182742291E-2,0.11490488990931171,0.14136980214529329,0.1797599864099366,0.21867647957851599]
["Centrálne zdroje tepla",0.67916873999999994,0.72389732130681506,1.01784590523,1.0131277129743101,0.73190283615835994,0.67817678538368598,0.34034674000588699,0.11507357333358501]
["Výroba elektriny",2.0330519300000001,0.173644094628325,2.1695118234912503,0.51510779279802599,1.0140419105721699,6.3968215858756297E-2,0.114103588551251,1.93396297362743]

{"sheet":"G26","index":26,"n_rows":45,"n_cols":9,"rows_kept":45,"cut":false,"hidden":false,"merged":[]}
["Graf 26: Konečná energetická spotreba biomasy podľa sektora do roku 2050 (WAM, v TWh)"]
[null,2019,2020,2025,2030,2035,2040,2045,2050]
["Domácnosti",6.7524710400000005,6.7774897566578591,7.0210026552714648,6.3460042133474142,4.2065284388058002,2.5035217318087839,1.5583371153017738,0.8197785504647177]
["Priemysel",6.5353040499999997,5.8356327750520265,6.2777035134382162,6.2468259586094854,8.6434080696747362,8.7472276482489519,8.9406513249481439,8.8697443014127924]
["Poľnohospodárstvo",9.333074999999999E-2,7.1669344676138808E-2,0.124096001485673,0.13554259646800401,0.142180513687446,0.15022721407071898,0.15665402163073699,0.16234095954918001]
["Služby",5.9440930000000003E-2,2.8921637725416702E-2,8.7219508609408608E-2,0.12572084905341502,0.24145356400253201,0.28837849765429496,0.32344703887099502,0.350475442290481]
["Centrálne zdroje tepla",0.67916873999999994,0.71833133833323592,0.919258949937234,0.919951521997321,0.62194041378056897,0.36380170464255096,0.168043823741967,0.23238850945856399]
["Výroba elektriny",2.0330519300000001,0.173644094628325,2.0651885968032797,0.73087344573112001,1.49009232139545,1.7334194917581598,1.1272538439368001,3.7847703558300001]
[]
[]
[]
[]
[]
[]
[]
[]
[]
[]
[]
[]
[]
[]
[]
[]
[]
[]
[]
[]
[]
[]
[]
[]
[]
[]
[]
[]
[]
[]
[]
[]
[]
[]
[]
[]
[null,null,null,null,null,null,0]

{"sheet":"G27","index":27,"n_rows":4,"n_cols":9,"rows_kept":4,"cut":false,"hidden":false,"merged":[]}
["Graf 27: Spotreba biomasy v priemysle do roku 2050 (WEM, v TWh)"]
[null,2019,2020,2025,2030,2035,2040,2045,2050]
["Papierenský",5.8463893700000025,2.3209653554570124,5.9481758998795957,4.8499351190054734,4.9373265174519716,5.0757491480601242,4.2713485993848739,4.2285742473083703]
["Ostatný",0.68891467999999956,0.54407389290597274,0.81496335367020789,0.86049144677542089,2.0533722078151126,1.866878959302962,2.6488090234244828,2.6330874331773688]

{"sheet":"G28","index":28,"n_rows":4,"n_cols":9,"rows_kept":4,"cut":false,"hidden":false,"merged":[]}
["Graf 28: Spotreba biomasy v priemysle do roku 2050 (WAM, v TWh)"]
[null,2019,2020,2025,2030,2035,2040,2045,2050]
["Papierenský",5.8463893700000025,5.3113976937088365,5.7246643428820931,5.41846240514929,5.8336086715650817,5.3055223965681604,4.7587557562918681,4.5463033759216396]
["Ostatný",0.68891467999999956,0.52423508134318653,0.55303917055612428,0.82836355346018919,2.8097993981096581,3.4417052516807947,4.1818955686562767,4.3234409254911537]

{"sheet":"G29","index":29,"n_rows":4,"n_cols":9,"rows_kept":4,"cut":false,"hidden":false,"merged":[]}
["Graf 29: Spotreba biomasy vo výrobe elektriny ( v TWh)"]
[null,2019,2020,2025,2030,2035,2040,2045,2050]
["WEM",2.0330519300000001,0.173644094628325,2.1695118234912503,0.51510779279802599,1.0140419105721699,6.3968215858756297E-2,0.114103588551251,1.93396297362743]
["WAM",2.0330519300000001,0.173644094628325,2.0651885968032797,0.73087344573112001,1.49009232139545,1.7334194917581598,1.1272538439368001,3.7847703558300001]

{"sheet":"G30","index":30,"n_rows":13,"n_cols":9,"rows_kept":13,"cut":false,"hidden":false,"merged":[]}
["Graf 30: Výroba tepla podľa palív v CZT (WAM, v TWh)"]
[null,2019,2020,2025,2030,2035,2040,2045,2050]
["Plynné palivá",3.4277459943739559,3.5980853557957571,4.3603753918039905,3.9380797895150317,2.6220598715026346,1.5221800436069053,1.4031471619548421,1.1667192611072723]
["Biomasa",1.265336597205122,0.72422282121890491,1.4336945466170543,0.9916641257073997,1.1049062904401998,0.96373094690211658,0.77094925985201967,0.62624303354283917]
["Tuhé fosílne palivá",0.59537833555308695,0.6069598837118837,2.5366813094142123E-2,0,0,0,0,0]
["Jadro",0.52278012999999957,0.53323573259999979,0.54631631268136149,0.54522606655338102,0.51636192885890986,0.48806647462859498,0.49267444848241515,0.46856025327537609]
["Geotermálna",4.8601770000000023E-2,4.8601770000000009E-2,4.8601770000000009E-2,0.12360177000000001,0.2926039285562087,0.30463555187702418,0.29999999999999993,0.29999999999999993]
["Elektrina",7.320890511462075E-3,1.8517859204667746E-2,2.4750856319829942E-2,2.8767859204667751E-2,1.93123967552064E-2,1.1827356467474947E-2,1.1402051404818377E-2,9.9582660429456838E-3]
["Slnko",5.582400000000001E-4,6.0000000000000019E-3,1.2250000000000006E-2,8.8843523486131795E-2,9.8999999999999991E-2,0.10889999999999998,0.11979000000000008,0.13176900000000008]
[]
[]
[]
[null,","]

{"sheet":"G31","index":31,"n_rows":8,"n_cols":38,"rows_kept":8,"cut":false,"hidden":false,"merged":[]}
["Graf 31: Odhad budúcej ťažby a spotreby dreva (v mil. m3)"]
[null,2014,2015,2016,2017,2018,2019,2020,2021,2022,2023,2024,2025,2026,2027,2028,2029,2030,2031,2032,2033,2034,2035,2036,2037,2038,2039,2040,2041,2042,2043,2044,2045,2046,2047,2048,2049,2050]
["Plán ťažby",9.3490000000000002,9.5239999999999991,9.6910000000000007,9.7479999999999993,9.8859999999999992,9.9420000000000002,9.8480000000000008,9.7420000000000009,9.6839999999999993,9.5329999999999995,9.3970000000000002]
["Vykonaná ťažba",9.4169999999999998,9.2479999999999993,9.3219999999999992,9.3940000000000001,9.8650000000000002,9.2189999999999994,7.51,7.641,7.6870000000000003,7.2229999999999999,8.6460000000000008]
["Spotreba dreva - dlhodobý priemer",7.7290000000000001,7.7290000000000001,7.7290000000000001,7.7290000000000001,7.7290000000000001,7.7290000000000001,7.7290000000000001,7.7290000000000001,7.7290000000000001,7.7290000000000001,7.7290000000000001,7.7290000000000001,7.7290000000000001,7.7290000000000001,7.7290000000000001,7.7290000000000001,7.7290000000000001,7.7290000000000001,7.7290000000000001,7.7290000000000001,7.7290000000000001,7.7290000000000001,7.7290000000000001,7.7290000000000001,7.7290000000000001,7.7290000000000001,7.7290000000000001,7.7290000000000001,7.7290000000000001,7.7290000000000001,7.7290000000000001,7.7290000000000001,7.7290000000000001,7.7290000000000001,7.7290000000000001,7.7290000000000001,7.7290000000000001]
["Referenčný scenár",null,null,null,null,null,null,null,null,null,null,9.5559252782889086,9.4196873155420384,9.3436583498949233,9.2528167668565793,9.1842502043519829,9.1166948277127862,9.1232665000833268,9.0921653720647981,9.1323502801404626,9.1031633594595274,9.1451747940708472,9.1480916462436674,9.1586287344204127,9.145811706349523,9.1160634882200551,9.1016970672635527,9.0667121891514242,9.052020779129327,9.0127999221648807,8.9791775718089628,8.956939299319906,8.9454255279694266,8.9438945226185158,8.9118485791791748,8.8871345611242347,8.899188793503976,8.8777352196217496]
["Bezzásahový scenár",null,null,null,null,null,null,null,null,null,null,9.0215521581328986,8.9307302974652565,8.9069273907337205,8.8098448978088477,8.7363091304587428,8.6636133311856849,8.6618941375122933,8.6247165038642439,8.6574594054050262,8.6259048755682155,8.661127253676824,8.6595485016918907,8.6626865342118595,8.643146104016207,8.6065718312840218,8.5822289719089611,8.5389337867266963,8.5143677204982815,8.4695426335759549,8.428434741360519,8.3971557605835621,8.3743983797052444,8.3609386087263946,8.319199643566396,8.2848179602577439,8.2850734628908231,8.2525765384120362]
["Scenár LULUCF",null,null,null,null,null,null,null,null,null,null,7.5477244332562474,7.526999952754629,7.6729781772587895,7.5920233021361812,7.5201997769576217,7.4824366943838028,7.5082249833691392,7.5873478746773513,7.6400762721776871,7.6093036467008242,7.5254301997011028,7.4570566316518931,7.4661386887118963,7.5503080872898209,7.5340412326337987,7.5718845557201409,7.5238653640285698,7.5751336582392419,7.5208596078338674,7.4604483759973546,7.4112813702914861,7.3801368952176807,7.4154007496373389,7.3666883323733812,7.3711268221297281,7.3474541846578827,7.3593955300249219]

{"sheet":"G32","index":32,"n_rows":12,"n_cols":2,"rows_kept":12,"cut":false,"hidden":false,"merged":[]}
["Graf 32: Očakávané objemy priemyselného dreva a rôznych druhov energetickej drevnej biomasy v prognóze (v mil. m3)"]
[]
["Energetické využitie",3.8006999999999995]
["Piliarsky priemysel",3.3220105241273101]
["Papierensky priemysel",2.3768000000000002]
[]
["Iné ako palivové drevo (pre domácnosti)",1.4319999999999999]
["Lesné štiepky",0.81200000000000006]
["Energetické drevo z ťažobných zvyškov",0.60870000000000002]
["Palivové drevo",0.59799999999999998]
["Drevná štiepka z bielych plôch",0.25]
["Priemyselné štiepky",0.1]

{"sheet":"G33","index":33,"n_rows":7,"n_cols":6,"rows_kept":7,"cut":false,"hidden":false,"merged":[]}
["Graf 33: Energetický potenciál drevných palív v roku 2020 (v TWh)"]
[null,"Priemysel",null,"Evidované drevo z lesov",null,"Neevidované drevo z lesov"]
["Čierny lúh",3.6318317259036101,"Energeticky využívané sortimenty dreva (palivové drevo a iné sortimenty)",4.3790947200000003,"Drevo z bielych plôch",0.46]
["Kôra",1.0192417302656096,null,null,"Lesné štiepky",1.4013450000000001]
["Spracované palivá",0.37691954677372502,null,null,"Energetické drevo z odpadu a ťažobných zvyškov",1.3621356500000001]
["Drevné zvyšky (odrezky, piliny...)",0.28697496428571434]
["Štiepka z priemyslu",0.28326585642872676]

{"sheet":"G34","index":34,"n_rows":5,"n_cols":7,"rows_kept":5,"cut":false,"hidden":false,"merged":[]}
["Graf 34: Porovnanie dopytu energie z biomasy na základe scenárov NECP a ponuky energie z biomasy na základe dostupnosti energetickej drevnej biomasy (v TWh)"]
[null,2025,2030,2035,2040,2045,2050]
["Dostupné množstvo energie z biomasy",14.273978961927712,14.273978961927712,14.273978961927712,14.273978961927712,14.273978961927712,14.273978961927712]
["Dopyt po energii z biomasy: WAM CPS",16.466690624589933,14.684073366848395,15.481759281594165,13.916118818799381,14.335917502359639,14.54909229290794]
["Dopyt po energii z biomasy: WEM CPS",17.256496085587745,14.507833787877258,15.114163520224007,13.344824383787559,13.529982142617358,13.190611170960796]

{"sheet":"G35","index":35,"n_rows":12,"n_cols":4,"rows_kept":12,"cut":false,"hidden":false,"merged":[]}
["Graf 35: Odhad potenciálneho vplyvu uplatnenia kaskádového princípu na dostupné množstvo energie v roku 2020 (v TWh)"]
[null,"Dostupné množstvo energie z biomasy","Základný scenár uplatnenia kaskádového princípu","Ambiciózny scenár uplatnenia kaskádového princípu"]
["Sortimenty dreva (palivové drevo)",{"$f":"598*1000*2387/1000000000","v":1.4274260000000001},{"$f":"598*1000*2387/1000000000","v":1.4274260000000001},1.3585182575999999]
["Sortimenty dreva (iné ako palivové drevo)",{"$f":"(2030-598+0.12*(2030-598))*((1000*2347)/1000000000)","v":3.7642124799999999},0,0]
["Čierny lúh",3.6659999999999999,3.6659999999999999,3.6659999999999999]
["Lesné štiepky",1.4940800000000001,1.4940800000000001,1.4940800000000001]
["Kôra",1.0429999999999999,1.0429999999999999,1.0429999999999999]
["Energetické drevo z odpadu a ťažobných zvyškov",{"$f":"788*1000*1840/1000000000","v":1.4499200000000001},{"$f":"788*1000*1840/1000000000","v":1.4499200000000001},1.4499200000000001]
["Drevo z bielych plôch",0.46,0.46,0]
["Spracované palivá",0.39500000000000002,0.37677965102432748,0]
["Drevné odpady (odrezky, piliny...)",0.3,0,0]
["Štiepka z priemyslu",0.28000000000000003,0,0]

{"sheet":"Príloha_G1","index":36,"n_rows":4,"n_cols":11,"rows_kept":4,"cut":false,"hidden":false,"merged":[]}
["Príloha Graf  1: Produkcia drevných produktov na Slovensku z štatistík Eurostat (v mil. m3)"]
[null,2014,2015,2016,2017,2018,2019,2020,2021,2022,2023]
["Produkcia rezivo",1.75,1.6,1.58,1.7370000000000001,1.73,1.653,1.522,1.6519999999999999,1.8149999999999999,1.3680000000000001]
["Produkcia panely",0.28799999999999998,0.39600000000000002,0.42599999999999999,0.46800000000000003,0.46200000000000002,0.46300000000000002,0.42599999999999999,0.43,0.34799999999999998,0.35299999999999998]

{"sheet":"Príloha_G2","index":37,"n_rows":29,"n_cols":6,"rows_kept":29,"cut":false,"hidden":false,"merged":[]}
["Príloha Graf  2: Rozdiely v prognózach ťažby v scenároch NECP a súčasnej štúdie (v mil. m3)"]
[null,"Ťažba WEM","Ťažba WAM","Referenčný scenár","Bezzásahový scenár","Scenár LULUCF"]
[2024,9.7183351693019695,9.1343386155141708,9.5559252782889086,9.0215521581329057,7.5477244332562474]
[2025,9.7206253518658396,9.1297582503864199,9.4196873155420384,8.93073029746526,7.526999952754629]
[2026,9.7618486380155698,9.0862447816728196,9.3436583498949233,8.9069273907337223,7.6729781772587895]
[2027,9.7618486380155698,9.0839545991089405,9.2528167668565793,8.8098448978088477,7.5920233021361812]
[2028,9.7595584554516996,9.0885349642366897,9.1842502043519829,8.7363091304587428,7.5201997769576217]
[2029,9.7618486380155698,9.0725036862895792,9.1166948277127862,8.6636133311856849,7.4824366943838028]
[2030,9.7595584554516996,9.0702135037257001,9.1232665000833268,8.6618941375122933,7.5082249833691392]
[2031,9.7687191857071891,9.0404411303953403,9.0921653720647981,8.6247165038642439,7.5873478746773513]
[2032,9.7618486380155698,9.0358607652676,9.1323502801404626,8.6574594054050262,7.6400762721776871]
[2033,9.7641388205794399,9.0335705827037192,9.1031633594595274,8.6259048755682155,7.6093036467008242]
[2034,9.7664290031433207,9.0381509478314701,9.1451747940708472,8.661127253676824,7.5254301997011028]
[2035,9.7664290031433207,9.0015080268094891,9.1480916462436674,8.6595485016918907,7.4570566316518931]
[2036,9.7687191857071891,8.9900571139901206,9.1586287344204127,8.6626865342118595,7.4661386887118963]
[2037,9.7641388205794399,8.9808963837346294,9.145811706349523,8.643146104016207,7.5503080872898209]
[2038,9.7664290031433207,8.9694454709152591,9.1160634882200551,8.6065718312840218,7.5340412326337987]
[2039,9.7137548041742203,8.9488338278403905,9.1016970672635527,8.5822289719089611,7.5718845557201409]
[2040,9.6748217005883692,8.8984498114351709,9.0667121891514242,8.5389337867266963,7.5238653640285698]
[2041,9.6221475016192706,8.8778381683603094,9.052020779129327,8.5143677204982815,7.5751336582392419]
[2042,9.6198573190554004,8.8572265252854407,9.0127999221648807,8.4695426335759549,7.5208596078338674]
[2043,9.5786340329056703,8.8572265252854407,8.9791775718089628,8.428434741360519,7.4604483759973546]
[2044,9.5809242154695493,8.8137130565718405,8.956939299319906,8.3971557605835621,7.4112813702914861]
[2045,9.5374107467559401,8.7701995878582402,8.9454255279694266,8.3743983797052444,7.3801368952176807]
[2046,9.5305401990643208,8.7587486750388699,8.9438945226185158,8.3609386087263946,7.4154007496373389]
[2047,9.5282500165004507,8.7564584924749997,8.9118485791791748,8.319199643566396,7.3666883323733812]
[2048,9.5328303816281998,8.7610388576027507,8.8871345611242347,8.2848179602577439,7.3711268221297281]
[2049,9.4824463652229696,8.7266861191446399,8.899188793503976,8.2850734628908231,7.3474541846578827]
[2050,9.4801561826590994,8.7083646586336485,8.8777352196217496,8.2525765384120362,7.3593955300249219]

{"sheet":"Príloha_G3","index":38,"n_rows":4,"n_cols":9,"rows_kept":4,"cut":false,"hidden":false,"merged":[]}
["Príloha Graf  3: Spotreba biomasy v službách (v GWh)"]
[null,2019,2020,2025,2030,2035,2040,2045,2050]
["WEM",59.440930000000002,28.921637725416598,88.209913757642198,97.351413182742291,114.90488990931171,141.36980214529331,179.7599864099366,218.67647957851599]
["WAM",59.440930000000002,28.921637725416701,87.219508609408607,125.72084905341501,241.453564002532,288.37849765429496,323.44703887099502,350.475442290481]

{"sheet":"Príloha_G4","index":39,"n_rows":4,"n_cols":9,"rows_kept":4,"cut":false,"hidden":false,"merged":[]}
["Príloha Graf  4: Spotreba biomasy v poľnohospodárstve (v GWh)"]
[null,2019,2020,2025,2030,2035,2040,2045,2050]
["WEM",93.330749999999995,71.669344676138806,124.20904971831401,115.02756566103599,109.80103847608299,112.568176135465,116.76910997114,119.89041573732599]
["WAM",93.330749999999995,71.669344676138806,124.096001485673,135.54259646800401,142.18051368744599,150.22721407071899,156.65402163073699,162.34095954918001]

{"sheet":"Príloha_G5","index":40,"n_rows":9,"n_cols":35,"rows_kept":9,"cut":false,"hidden":false,"merged":[]}
["Príloha Graf  5: Záchyty v sektore LULUCF (v kt CO2 ekv.)"]
[null,1990,1991,1992,1993,1994,1995,1996,1997,1998,1999,2000,2001,2002,2003,2004,2005,2006,2007,2008,2009,2010,2011,2012,2013,2014,2015,2016,2017,2018,2019,2020,2021,2022,2023]
["Lesy",-8243.3501507494857,-9609.1345634985028,-10333.278154801643,-10112.970216290114,-9338.4139064473566,-8585.1448583244965,-8456.9379830681501,-8051.4898533061751,-8828.5658380179939,-7846.2967156132618,-7455.7984453952376,-7623.0309091693016,-7543.6441204963412,-6737.6509314688519,-6316.9267953766912,-1831.4171556872682,-4834.5203680946324,-4390.5695847727256,-3342.2739270236352,-3696.3430865396026,-2807.9255377127247,-3329.7371682510811,-5019.7469243727355,-6006.1620698484212,-3555.3683948321659,-3897.0090190973342,-3685.050888713768,-3561.8093978042411,-2853.9739910049402,-3787.6172843750733,-6458.1049019885422,-6300.3137798616544,-6573.7906546129307,-6986]
["Poľnohospodárska pôda",-399.36082655238533,-304.18210287617183,-182.73184226350199,-53.16726169152664,-145.99204410688827,-311.61654059805147,-355.18766053282519,-387.83407448424276,-321.9259720369684,-231.79040417387199,-410.38620401226723,-244.60246836109636,-402.46574950235595,-514.97572421075995,-557.26911239289825,-495.6485345807742,-575.17553618179636,-494.39686318865176,-564.38905088188164,-537.74290169293442,-546.97511817368138,-552.73625953007206,-630.62379805195474,-490.27685613268557,-491.18991093708422,-489.40189481965444,-578.00655374485996,-609.94620989337659,-616.28712835230181,-622.06489944758664,-568.11802364449079,-645.4385339136436,-641.69212501532456,-646]
["Trávnaté porasty",-194.91765722813011,-85.190679956825775,-440.66577910322809,-302.10945546237224,-230.72503161540448,-256.85565007659346,-157.57306000565299,-182.3515446376681,-147.67610047761875,-239.6725792181812,-308.97994337305812,-302.91641487694704,-323.08016065747995,-240.02168532749613,-301.75602643186164,-199.79864997075774,-252.57797822848943,-230.25878594946039,-232.96466957536191,-267.10448269580917,-214.87119505437948,-274.15885227446341,-215.9981697763204,-203.3730084580688,-181.93762801553606,-190.43444637474619,-178.12967294469428,-164.48346661621889,-110.54052586555763,-117.74324105737561,-92.544542451592065,-54.969658299256778,-35.997114694553488,-27]
["Sídla",100.40198064817803,89.201859166769481,89.358359009899218,91.307672135137764,64.032927561325565,64.732189753783558,70.578762053491204,79.564431971770446,48.029717025714071,63.262615785795688,57.216833227361803,64.180789150628144,50.512872092805949,70.587431755037599,74.846996535584822,64.661340723018526,66.028695055707303,65.798958358652186,122.2000855387187,237.89534678985353,104.84528356919132,73.093364162546592,85.385066953847627,100.31964740371356,84.743553040959597,89.183109286530424,84.060495196800403,104.80304175173588,85.556320596515292,88.285244752408715,83.373235246355875,90.503667585245438,84.564015638647433,82]
["Iné plochy",301.64739670337281,180.21543418626061,173.03071750281114,156.23335440190149,146.46976530256114,110.67445401460473,112.48154895918375,123.57549080931264,120.39777293899846,153.27405583920694,110.86168534118946,132.0303620462758,89.792214816955536,86.534822225208046,100.79228201360274,190.18211714929907,110.12044077305951,146.15969102038542,134.09516472257874,131.29992940458467,92.766474665920356,83.675252726451404,119.68561928724463,99.874541480404531,113.53611518638209,189.92490625473306,103.72882352215331,99.838523730223187,148.55600684693388,85.113041410401181,99.261134377728055,76.658861592701498,80.712557151405846,94]
["Produkty z vyťaženého dreva",-470.40933831138852,1.87797604591268,337.73030785318406,75.328632313585345,-80.370808475619242,-58.765648562410007,-158.90917385230409,-314.70144429314627,-669.72752048976599,-857.55611415727572,-920.07104744550963,-273.77707253842783,-597.09212362644962,-814.86158040636803,-1157.8732839702657,-1996.4559554143013,-1875.880394819894,-2011.7004711135057,-1938.0725406656272,-1460.0724933883264,-1334.5972089966215,-1068.8624391898013,-508.4112805035457,-440.4235081277464,-728.39549997481095,-940.69593511275411,-1063.6575028952991,-1077.0399890236304,-889.18844950258131,-644.91383873198959,-247.28375746108355,-382.19520992570347,-143.85368093128324,-291]
["Cieľ",-5419,-5419,-5419,-5419,-5419,-5419,-5419,-5419,-5419,-5419,-5419,-5419,-5419,-5419,-5419,-5419,-5419,-5419,-5419,-5419,-5419,-5419,-5419,-5419,-5419,-5419,-5419,-5419,-5419,-5419,-5419,-5419,-5419,-5419]

{"sheet":"Príloha_G6","index":41,"n_rows":14,"n_cols":7,"rows_kept":14,"cut":false,"hidden":false,"merged":[]}
["Príloha Graf  6: Emisie z LULUCF do roku 2050 v scenári WEM a WAM doplnených o scenáre vývoja emisií vplyvom prognóz výšky ťažbe v súčasnej štúdii (v Mt CO2 ekv.)"]
["WEM",2025,2030,2035,2040,2045,2050]
["Celkové emisie - NECP",-3620.3412972706792,-2541.551371663938,-1405.1120795663883,-537.95496937219923,-882.06956715025876,-1275.3730002943255]
["Celkové emisie - Referenčný scenár",-4124.8702659166647,-3608.3082626218002,-2441.7677072923411,-1557.4633983398785,-1874.545279215662,-2285.344457823624]
["Celkové emisie - Rozšírenie ochrany prírody",-4944.617025269672,-4381.8087648955088,-3260.8205989466346,-2442.2950278068297,-2831.8843437684636,-3333.4361797070205]
["Celkové emisie - Redukovaný scenár",-7298.0005713492337,-6315.9594479027301,-5276.8235954694055,-4144.078659630467,-4498.7847045895624,-4830.8729892263718]
["Cieľ",-5419,-5419,-5419,-5419,-5419,-5419]
[]
["WAM"]
["Celkové emisie NECP",-4758.6273245749035,-4169.0155395372385,-3670.6760984196167,-3609.1984413157847,-4581.8518099793118,-6029.1412433149671]
["Celkové emisie - Referenčný scenár",-4272.555128416665,-4080.0710715568184,-3424.9255670579141,-3327.1030142034747,-4288.0818235585984,-5745.1879235612159]
["Celkové emisie - Rozšírenie ochrany prírody",-5092.3018877696713,-4853.5715738305271,-4243.9784587122085,-4211.9346436704263,-5245.4208881114009,-6793.2796454446125]
["Celkové emisie - Redukovaný scenár",-7445.685433849234,-6787.7222568377483,-6259.9814552349781,-5913.7182754940641,-6912.3212489324978,-8290.7164549639638]
["Cieľ",-5419,-5419,-5419,-5419,-5419,-5419]

{"sheet":"Príloha_G7","index":42,"n_rows":12,"n_cols":4,"rows_kept":12,"cut":false,"hidden":false,"merged":[]}
["Priloha Graf  7: Energetický potenciál drevných palív v roku 2025 pre rôzne scenáre (v TWh"]
[null,"Základný scenár z štúdie","Maximálne priemyselné využitie - referenčný scenár ťažby","Maximálne priemyselné využitie - LULUCF scenár ťažby"]
["Sortimenty dreva (palivové drevo)",{"$f":"598*1000*2387/1000000000","v":1.4274260000000001},0.72822970207474702,0.59259936438237815]
["Sortimenty dreva (iné ako palivové drevo)",{"$f":"(2030-598+0.12*(2030-598))*((1000*2347)/1000000000)","v":3.7642124799999999},0,0]
["Čierny lúh",3.6659999999999999,4.5995510507166122,3.6290335308573667]
["Lesné štiepky",1.4940800000000001,1.4940800000000001,1.4940800000000001]
["Kôra",1.0429999999999999,1.6026264925203699,1.3122396213302969]
["Energetické drevo z odpadu a ťažobných zvyškov",{"$f":"788*1000*1840/1000000000","v":1.4499200000000001},{"$f":"788*1000*1840/1000000000","v":1.4499200000000001},1.4499200000000001]
["Drevo z bielych plôch",0.46,0.46,0.46]
["Spracované palivá",0.39500000000000002,0.71286997426696364,0.59791653980493364]
["Drevné odpady (odrezky, piliny...)",0.3,0.55117341949117404,0.46312162031413451]
["Štiepka z priemyslu",0.28000000000000003,0.51370384018312665,0.43163793175445836]

{"sheet":"Príloha_G8","index":43,"n_rows":10,"n_cols":7,"rows_kept":10,"cut":false,"hidden":false,"merged":[]}
["Priloha Graf  8: Porovnanie dopytu energie z biomasy na základe scenárov NECP a ponuky energie na základe základného scenáru štúdie a dvoch alternatívnych scenárov (v TWh)"]
[null,2025,2030,2035,2040,2045,2050]
["Základný scenár štúdie",14.273978961927712,14.273978961927712,14.273978961927712,14.273978961927712,14.273978961927712,14.273978961927712]
["Základný scenár štúdie  po aplikácii kaskádového princípu",8.9926067460144594,8.9926067460144594,8.9926067460144594,8.9926067460144594,8.9926067460144594,8.9926067460144594]
["WAM CPS",16.466690624589933,14.684073366848395,15.481759281594165,13.916118818799381,14.335917502359639,14.54909229290794]
["WEM CPS",17.256496085587745,14.507833787877258,15.114163520224007,13.344824383787559,13.529982142617358,13.190611170960796]
["Maximálne priemyselné využitie - referenčný scenár ťažby",12.112154479252995,12.048226598235694,12.308892576256229,12.355796866504331,12.225600258089099,12.056326260609643]
["Maximálne priemyselné využitie - LULUCF scenár ťažby",10.430548608443569,10.394630634196176,10.53015759875432,10.623785477840146,10.474894715614992,10.309036925736921]
["Maximálne priemyselné využitie - referenčný scenár ťažby po aplikácii kaskádového princípu",9.8744072453117298,9.8898385850392447,10.194753509026055,10.280989799097117,10.171458510684015,9.9963494382669396]
["Maximálne priemyselné využitie - LULUCF scenár ťažby po aplikácii kaskádového princípu",8.4778725165700415,8.4920653660604266,8.6669949267150894,8.7793246778729799,8.6558562371545342,8.481722503805436]

{"sheet":"Príloha_G9","index":44,"n_rows":1,"n_cols":1,"rows_kept":1,"cut":false,"hidden":false,"merged":[]}
["Príloha Graf  9: Prehľad štatistických výkazov v drevárskom sektore"]

{"sheet":"T1","index":45,"n_rows":5,"n_cols":4,"rows_kept":5,"cut":false,"hidden":false,"merged":[]}
["Tabuľka 1: Scenáre výpočtu rastu a ťažby dreva v lesoch v horizonte do roku 2050"]
["Varianty","Popis","Parametre ťažby","Definícia ťažby"]
["Referenčný scenár","Výška ťažby nadväzuje na súčasnú výšku plánovaných ťažieb ","Počiatočná ťažba na úrovni priemeru plánovanej ťažby za posledné 4 roky vo výške 9,7 mil. m3 ročne","Ťažba nie je obmedzená, riadi sa PSL, rúbnou a obnovnou dobou a prirodzeným vývojom lesa."]
["Bezzásahový scenár","Rozšírenie bezzásahovej oblasti v NP podľa Envirostratégie 2030 a zákona o ochrane prírody ","Odvodené od referenčného scenáru, 75 % plochy národného parku v 5. stupni ochrany, kde sa neťaží","Ťažba sa znižuje v NP, kde 75 % plochy prechádza do bezzásahového režimu. Na zvyšných JPRL je ťažba rovnaká ako v referenčnom scenári."]
["Scenár LULUCF ","Scenár spĺňa cieľ LULUCF v roku do roku 2030 ","Ťažba na úrovni tesne pod 8 mil. m3 do roku 2030","Ťažba plošne znížená pod 8 mil. m³, interval obnovy predĺžený o zhruba o 30 %."]

{"sheet":"Príloha_T1","index":46,"n_rows":36,"n_cols":4,"rows_kept":36,"cut":false,"hidden":false,"merged":[[28,0,31,0],[28,1,31,1],[28,2,31,2],[32,0,35,0],[32,1,35,1],[32,2,35,2],[21,0,24,0],[21,1,24,1],[21,2,24,2],[25,0,27,0],[25,1,27,1],[25,2,27,2],[2,0,4,0],[2,1,4,1],[2,2,4,2],[9,0,17,0],[9,2,17,2],[18,0,20,0],[18,1,20,1],[18,2,20,2]]}
["Tabuľka 1: Rozpis zdrojov informácií ku Schéme 1 v hlavnom texte"]
["Položka","Zdroj údaju","Detail","Konverzný faktor a výhrevnosť"]
["Materiálové využitie zvyškov","Moravčík, M., 2023. Vyhodnotenie empirického prieskumu a aproximácia výsledkov pre podmienky SR","Štúdia priamo sumarizuje množstvo a druh drevných zvyškov, ktoré smerujú na ďalšie spracovanie","Pôvodné jednotky – tony"]
[null,null,null,"Konverzia-"]
[null,null,null,"tony na m3 2,128"]
["Surové drevo ","Zelená správa za rok 2023","-","Výhrevnosť (kWh/m3) 2506"]
["Obchod s drevom","Zelená správa za rok 2023","Vypočítané ako rozdiel importu a exportu dreva","-"]
["Drevársky a celulózový priemysel","Výpočty IEP","Vypočítané na základe úrovne domácej spotreby dreva a ukazovateľov popísaných v odstavcoch vyššie","-"]
["Produkt","Eurostat - Sawnwood and panels","Európske štatistiky uvádzajúce množstvo vyrobených drevných produktov","Položky sú uvedené v jednotkách tak ako ich uvádza štatistika"]
["Zvyšky","Moravčík, M., 2023. Vyhodnotenie empirického prieskumu a aproximácia výsledkov pre podmienky SR","Odpady vytvárané v drevárskom sektore sú prebrané zo štúdie (Moravčík, 2023). Štúdia definuje množstvo energeticky a materiálovo zhodnocovaných drevných odpadov. Celulózo-papierenský priemysel ale nie je pokrytý a preto sa množstvo vytvoreného čierneho lúhu prebralo z výkazov ÚRSO. Množstvo kôry je vypočítané odlišne.","Pôvodné jednotky – tony"]
[null,"Výkazy na základe vyhlášky ÚRSO 490/2009 §2",null,"Konverzia-"]
[null,null,null,"Zvyšky tony na m3 2,128"]
[null,null,null,"Čierny lúh tony na m3 0,77 (zhruba 60 % obsah sušiny, podľa evidenčných lístkov ÚRSO)"]
[null,null,null,"Kôra tony na m3 2,05"]
[null,null,null,"Výhrevnosť (kWh/t)"]
[null,null,null,"Zvyšky 3319"]
[null,null,null,"Čierny lúh 2500"]
[null,null,null,"Kôra 2753"]
["Kôra","UNECE, Forest products conversion factors, 2020","Množstvo vytvorenej kôry je spočítané ako 12 % objemu vstupného surového dreva. Koeficient je prebraný z uvedenej publikácie a porovnaný s výkazmi ÚRSO pre celulózovo-papierenský priemysel, z ktorých sa dá odvodiť koeficient až 16 %.","Položka je už uvedená v m3"]
[null,null,null,"Kôra tony na m3 2,05"]
[null,null,null,"Výhrevnosť (kWh/t) 2753"]
["Pelety, štiepané drevo, brikety","Moravčík, M., 2023. Vyhodnotenie empirického prieskumu a aproximácia výsledkov pre podmienky SR","-","Pôvodné jednotky – tony"]
[null,null,null,"Konverzia-"]
[null,null,null,"tony na m3 2,273"]
[null,null,null,"Výhrevnosť (kWh/t) 4655"]
["Export pelet, štiepaného dreva a brikiet","FAOSTAT – Forestry database","Štatistika FAOSTAT priamo uvádza exportované množstvo týchto produktov","Položka je už uvedená v m3"]
[null,null,null,"Konverzia-"]
[null,null,null,"tony na m3 2,273"]
["Biele plochy","Šebeň. V., Odhad potenciálu palivového dreva v SR na bielych plochách, 2022","Celková ťažba na bielych plochách sa odhaduje na úrovni 0,5 mil. m3 ročne. Nie je známe, kde toto drevo skončí, dá sa však očakávať, že vzhľadom na jeho kvalitu sa značná časť zhodnocuje energeticky. Konzervatívny odhad preto je, že 50 % objemu dreva vyťaženého na bielych plochách smeruje do energetického sektoru.","Položka je už uvedená v m3"]
[null,null,null,"Konverzia-"]
[null,null,null,"tony na m3 1,53"]
[null,null,null,"Výhrevnosť (kWh/t) 1840"]
["Odpad po ťažbe","Zelená správa za rok 2023","Suma položiek lesné štiepky a dreva použitého na energiu z odpadu, poťažbových zvyškov a suchých stromov","Pôvodné jednotky – tony"]
[null,null,null,"Konverzia-"]
[null,null,null,"tony na m3 1,53"]
[null,null,null,"Výhrevnosť (kWh/t) 2753"]

{"sheet":"Príloha_T2","index":47,"n_rows":6,"n_cols":2,"rows_kept":6,"cut":false,"hidden":false,"merged":[[28,0,31,0],[28,1,31,1],[28,2,31,2],[32,0,35,0],[32,1,35,1],[32,2,35,2],[21,0,24,0],[21,1,24,1],[21,2,24,2],[25,0,27,0],[25,1,27,1],[25,2,27,2],[2,2,4,2],[9,0,17,0],[9,2,17,2],[18,0,20,0],[18,1,20,1],[18,2,20,2]]}
["Tabuľka 2: Zhrnutie simulácií v modeli SIBYLA"]
["Krok modelu ","Popis"]
["Generovanie štruktúry lesa","Opis drevín – rastové tabuľky. Zastúpenie dreviny – 100 %. Simulačná plocha – 0,25 ha. Skutočná plocha – 1 ha. Stupeň variability hrúbky – 2. Triedy kvality – A 10 %, B 40 %, C 40 %, D 10 %. Dĺžka simulácií - 27 rokov. Zakmenenie – 1. Počet opakovaní – 1. "]
["Určenie ekologickej bonitácie","Určenie unikátnej kombinácie nasledujúcich parametrov zodpovedajúcim rôznym územiam na Slovensku pre jednotlivé druhy drevín. Koncentrácia NO2, koncentrácia CO2, zásobenosť živinami v pôde, počet dní vegetačného obdobia, ročná teplota amplitúda, priemerná teplota vo vegetačnom období, pôdna vlhkosť, zrážky vo vegetačnom období. "]
["Priebeh simulácií","Uvažuje sa s prirodzenou mortalitou a korekciou okrajového efektu. "]
["Extrahované výsledky","Zásoba dreva, kvalitatívne triedy dreva. Celková biomasa a jej zložky. Množstvo mŕtveho dreva."]

{"sheet":"Príloha_T3","index":48,"n_rows":14,"n_cols":4,"rows_kept":14,"cut":false,"hidden":false,"merged":[[2,0,4,0],[5,0,7,0]]}
["Tabuľka 3: Výška ťažby zadávaná do modelu"]
["Stupeň ochrany","Klasifikácia porastu","Vek porastu ","Výška ťažby"]
["5.","Hospodársky","-",0]
[null,"Ochranný","-",0]
[null,"Osobitý","-",0]
["4.","Hospodársky ","-","Ťažba určená na základe PSL"]
[null,"Ochranný","-","Ťažba určená na základe PSL"]
[null,"Osobitý","-","Ťažba určená na základe PSL"]
["3., 2., 1.","Hospodársky ","Mladé porasty","Výška ťažby odstupňovaná podľa veku a druhu dreviny"]
[null,null,"Prechodné porasty","Po dosiahnutí dostatočného veku výška ťažby zodpovedajúca intervalu obnovy"]
[null,null,"Porasty vhodné na ťažbu","Výška ťažby zodpovedajúce intervalu obnovy"]
[null,null,"Prestarnuté porasty","Ťažba odstupňovaná podľa rozdielu veku voči intervalu obnovy"]
[null,"Ochranný","-","Ťažba určená na základe PSL pre daný stupeň ochrany"]
[null,"Osobitý","-","Ťažba určená na základe PSL pre daný stupeň ochrany"]

{"sheet":"Príloha_T4","index":49,"n_rows":22,"n_cols":2,"rows_kept":22,"cut":false,"hidden":false,"merged":[]}
["Tabuľka 4: Opatrenia týkajúce sa biomasy v scenári s dodatočnými opatreniami (WAM)"]
["Sektor","Opatrenie"]
["Výroba elektriny a tepla","čistejšia výroba elektriny vďaka spusteniu tretieho a štvrtého bloku jadrovej elektrárne v Mochovciach "]
[null,"ukončenie prevádzky výroby elektriny a tepla z uhlia v Novákoch a Vojanoch"]
[null,"podpora inštalácie OZE (vietor a slnko) vo výrobe elektriny"]
[null,"nahradenie tuhých fosílnych palív za zemný plyn či biomasu v teplárenstve "]
[null,"podpora OZE vrátane geotermálnej energie vo výrobe tepla"]
[null,"zavedenie systému obchodovania s emisnými kvótami v sektore budov a dopravy (ETS2) od roku 2027, pričom predpokladaná cena pre rok 2030 je približne 59,2 eur za tonu CO2ekv[1]"]
["Domácnosti","odklon od hnedého uhlia po 2025"]
[null,"podpora investícií do zlepšenia termoizolačných vlastností budov"]
[null,"zavedenie vyšších nárokov na energetickú efektívnosť pre novostavby a rekonštruované budovy, ktoré zodpovedajú uplatneniu prísnejších noriem a zavedeniu energetických tried"]
[null,"podpora efektívnejších technológií vo vykurovaní a ohreve vody (napr. tepelné čerpadlá a solárne ohrievače vody) spojená so znižovaním podielu tuhých fosílnych palív"]
[null,"podpora investícií do nových technológií ako sú napr. systémy riadenia energií"]
[null,"podpora energeticky efektívnych spotrebičov, ako sú napr. variče či LED žiarovky"]
[null,"podpora nových vysoko účinných kogeneračných jednotiek využívajúcich zemný plyn a napojených na centrálne zásobovanie teplom"]
[null,"prechod od uhlia v centrálnom zásobovaní teplom, postupná náhrada zemným plynom, biomasou, geotermálnou a solárnou energiou či elektrinou"]
["LULUCF","navýšenie plochy bezzásahových území v národných parkoch"]
[null,"podpora prírode blízkeho hospodárenia v lesoch, reštrukturalizácia lesov"]
[null,"hlúčiková výsadba"]
[null,"pokles ťažby v lesoch (o 5 až 8 %)"]
[null,"podpora trvalo udržateľných poľnohospodárskych postupov"]
[null,"zvýšená miera výstavby z dreva"]

{"sheet":"Príloha_T5","index":50,"n_rows":19,"n_cols":4,"rows_kept":19,"cut":false,"hidden":false,"merged":[[4,0,12,0],[4,1,12,1],[4,2,12,2],[13,0,18,0],[13,1,18,1],[13,2,18,2]]}
["Tabuľka 5: Prehľad štatistických výkazov v drevárskom sektore"]
["Názov výkazu ","Subjekty, ktoré výkaz vyplňujú","Popis výkazu","Návrh zlepšenia"]
["Štvrťročný výkaz o dodávkach dreva v lesníctve ","Obhospodarovatelia a vlastníci lesa, ktorý uvádzajú drevo na trh a vykonávajú v lese hospodársku činnosť","Výkaz obsahuje vyťažené objemy jednotlivých druhov dreva spolu s kvalitatívnymi triedami. Obsahuje tiež množstvo dodávaných energetických štiepok. Výkaz rozlišuje drevo dodávané na domáci trh a drevo na vývoz, pričom zaznamenáva aj cenu dreva","-"]
["Colné štatistiky (Finančné riaditeľstvo SR)","Subjekty obchodujúce so surovinami","-","Sledovať a vykazovať toky štiepky do a zo zahraničia"]
["Ročný výkaz o spracovaní dreva","Vybrané subjekty, ktoré priemyselne spracovávajú drevo (reprezentatívna vzorka)","Výkaz kvantitatívne popisuje vstupy a produkciu priemyselných podnikov. Sleduje vstup surového dreva a recyklovaných drevných produktov. Na výstupe sleduje množstvá výrobných produktov, ale aj množstvá vytvorených drevných odpadov spolu s ich konečným využitím","Pridať položky na vstupe:"]
[null,null,null,"Nakúpená priemyselná štiepka pre energetické zhodnotenie"]
[null,null,null,"Nakúpená priemyselná štiepka pre priemyselné zhodnotenie"]
[null,null,null,"Nakúpená lesná štiepka pre energetické zhodnotenie"]
[null,null,null,"Pridať položky na výstupe:"]
[null,null,null,"Vytvorená štiepka pre energetické zhodnotenie (vlastná spotreba)"]
[null,null,null,"Vytvorená štiepka pre energetické zhodnotenie (predaj)"]
[null,null,null,"Vytvorená štiepka pre priemyselné využite (vlastné spracovanie)"]
[null,null,null,"Vytvorená štiepka pre priemyselné využite (predaj)"]
["Ročný výkaz o obnoviteľných zdrojoch palív a energie, Ročný výkaz o výrobe elektriny, tepla a chladu, Ročný výkaz o zdrojoch a rozdelení palív a energie ","Subjekty, ktoré vyrábajú, dovážajú, vyvážajú, spotrebúvajú palivá a energie a subjekty, ktoré vyrábajú elektrinu a/alebo teplo.","Výkazy sledujú spotrebu rôznych druhov palív pri činnosti subjektov. Rovnako sledujú aj výrobu elektrickej energie a tepla. V prípade subjektov, ktoré energeticky zhodnocujú biomasu sa vypĺňa modul biomasa, kde sa sledujú množstvá a druhy spaľovaných drevných palív","Motivovať podniky k dôslednému a úplnému vypĺňaniu dotazníkov"]
[null,null,null,"Pomoc podnikom pri vypĺňaní dotazníka, napríklad vo forme praktických príkladov tak aby sa zamedzilo chybné vyplnenie dotazníka"]
[null,null,null,"Krížová kontrola vzhľadom na štatistiky NLC"]
[null,null,null,"Rozšíriť položku primárna biomasa z lesa o 1. lesné štiepky vzniknuté po ťažbe a 2. energetické drevo a iné poťažbové zvyšky (všetky tieto údaje reportuje NLC v Zelenej správe)"]
[null,null,null,"Nevypĺňať položky ako konáre, pne ak sa zoštiepkujú, potom by mali patriť do kategórie lesné štiepky"]
[null,null,null,"Rozdeliť položku Štiepky, piliny a iné časti dreva tak aby boli štiepky samostatne vo vlastnej kategórii"]

{"sheet":"Príloha_T6","index":51,"n_rows":12,"n_cols":2,"rows_kept":12,"cut":false,"hidden":false,"merged":[[3,0,6,0],[8,0,9,0]]}
["Tabuľka 6: Sortimenty dreva a ich využitie"]
["Trieda kvality","Využitie"]
["I. trieda ","výroba hudobných nástrojov, technických potrieb a dýh"]
["II. trieda ","výrezy na špeciálne rezivo, športové náradie a pre výrobu lúpaných dýh"]
[null,"preglejkárske a zápalkárske výrezy"]
[null,"výrezy pre športové a iné potreby"]
[null,"sudárenské výrezy"]
["III. trieda ","piliarske výrezy, výrezy na výrobu podvalov, stĺpové výrezy a stĺpovina, špeciálne banské výrezy, výrezy pre stavebné účely"]
["IV. trieda ","drevo určené na výrobu drevoviny"]
[null,"banské výrezy a banské drevo, žrde"]
["V. trieda ","vlákninové drevo a ostatné priemyselné drevo"]
["VI. trieda ","palivové drevo"]

{"sheet":"Príloha_T7","index":52,"n_rows":50,"n_cols":8,"rows_kept":50,"cut":false,"hidden":false,"merged":[[14,0,14,7],[26,0,26,7],[38,0,38,7],[1,0,1,7],[11,0,12,0],[11,1,12,1],[11,2,12,2],[11,3,12,3],[11,4,12,4],[11,5,12,5],[11,6,12,6]]}
["Tabuľka 7: Vývoj cien sortimentov dreva"]
["Ihličnaté - tuzemské ceny"]
[null,2018,2019,2020,2021,2022,2023,2024]
["Výrezy I. triedy ",191.89,124.44,205.3,92.91,137.12,77.97,215.95]
["Výrezy II. triedy ",90.52,91.08,95.67,99.6,136.56,130.87,127.74]
["Výrezy III. triedy ",60.31,55.68,54.75,82.66,104.1,86.19,79.7]
["Banské drevo ",46.77,43.31,43.36,49.37,80.2,74.34,38.700000000000003]
["Žrde ",33.65,28.94,29.55,34.14,44.75,49.39,40.86]
["Vlákninové drevo ",30.13,27.6,21.52,29.66,44.76,44.97,39.090000000000003]
["Drevo na energetické účely ",10.42,19.36,8.93,11.95,10.220000000000001,13.16,11.09]
["Palivové drevo ",21.03,20.399999999999999,18.71,21.38,29.22,35.86,33.06]
["Drevo ihličnaté na pni ",18.21,14.41,10.68,33.049999999999997,57.98,52.5]
[null,null,null,null,null,null,null,35.159999999999997]
["Surové ihličnaté kmene ",48.07,44.32,41.52,73.91,112.22,80.209999999999994,77.72]
["Ihličnaté - vývozné ceny"]
[null,2018,2019,2020,2021,2022,2023,2024]
["Výrezy I. triedy ",147.6,null,null,null,null,217.73,162.65]
["Výrezy II. triedy ",105.31,117.64,134.85,131.99,142.32,152.43,134.24]
["Výrezy III. triedy ",60.25,66.19,55.17,78.03,94.88,65.91,80.64]
["Banské drevo ",null,38.01,36,63.54,92.81]
["Žrde ",null,null,null,null,null,53.91]
["Vlákninové drevo ",47.43,32.229999999999997,27.97,32.090000000000003,51.57,45.2,41.86]
["Drevo na energetické účely ",10.42]
["Palivové drevo ",19.36,25.76,18.600000000000001,0,42]
["Drevo ihličnaté na pni ",25.66,35.659999999999997,18.12,27.04,39.14,47.17,42.01]
["Surové ihličnaté kmene ",56.82,65.41,null,null,null,72.7,76.87]
["Listnaté – tuzemské ceny"]
[null,2018,2019,2020,2021,2022,2023,2024]
["Výrezy I. triedy ",269.2,236.59,374.27,397.13,453.09,386.44,410.97]
["Výrezy II. triedy ",146.01,181.89,137.94999999999999,150.79,187.89,176.55,192.78]
["Výrezy III. triedy ",62.56,65.48,63.96,64.87,75.13,111.15,108.24]
["Banské drevo ",51.55,52.48,52.28,60.82,62.81,85.99,79.05]
["Žrde ",44.99,45.74,46.78,65.98,60.44,79.010000000000005,62.1]
["Vlákninové drevo ",44.59,47.61,44.25,44.3,55.5,70.239999999999995,59.91]
["Drevo na energetické účely ",9.94,11.95,8.0399999999999991,9.0299999999999994,10.17,20.18,17.54]
["Palivové drevo ",38.22,42.67,42.78,42.68,49.55,63.64,60.57]
["Drevo na pni ",22.05,19.14,14.06,18.77,24.65,33.71,21.91]
["Surové kmene ",42.18,37.53,39.119999999999997,38.99,53.95,58.82,50.73]
["Listnaté – vývozné ceny"]
[null,2018,2019,2020,2021,2022,2023,2024]
["Výrezy I. triedy ",483.33,476.36,488.35,496.94,735.71,769.34,773.06]
["Výrezy II. triedy ",190.62,186.38,294,207.3,181.58,239.26,217.11]
["Výrezy III. triedy ",70.95,71.430000000000007,73.42,71.5,82.03,107.96,98]
["Banské drevo ",66.48,69.900000000000006,70.42,76.23]
["Žrde "]
["Vlákninové drevo ",50.82,54.1,49.45,48.63,63.8,68.8,62]
["Drevo na energetické účely "]
["Palivové drevo ",18.79,40.1,38.619999999999997,40.71,56.31,56,43.83]
["Drevo na pni ",null,21.59,12.92,18.59,22.35,30.37,32.85]
["Surové kmene "]

{"sheet":"S1","index":53,"n_rows":1,"n_cols":1,"rows_kept":1,"cut":false,"hidden":false,"merged":[[14,0,14,7],[26,0,26,7],[38,0,38,7],[1,0,1,7],[11,0,12,0],[11,1,12,1],[11,2,12,2],[11,3,12,3],[11,4,12,4],[11,5,12,5],[11,6,12,6]]}
["Schéma 1: Odhadované využívanie drevnej biomasy (2020, v mil. m3)"]

{"sheet":"M2","index":54,"n_rows":1,"n_cols":1,"rows_kept":1,"cut":false,"hidden":false,"merged":[[14,0,14,7],[26,0,26,7],[38,0,38,7],[1,0,1,7],[11,0,12,0],[11,1,12,1],[11,2,12,2],[11,3,12,3],[11,4,12,4],[11,5,12,5],[11,6,12,6]]}
["Mapa 2: Smrekové porasty podľa nadmorskej výšky (2023)"]

{"sheet":"M3","index":55,"n_rows":1,"n_cols":1,"rows_kept":1,"cut":false,"hidden":false,"merged":[[14,0,14,7],[26,0,26,7],[38,0,38,7],[1,0,1,7],[11,0,12,0],[11,1,12,1],[11,2,12,2],[11,3,12,3],[11,4,12,4],[11,5,12,5],[11,6,12,6]]}
["Mapa 3 : Stav lesov podľa stupňa defoliácie (satelitné dáta) (2023)"]

{"sheet":"M4","index":56,"n_rows":1,"n_cols":1,"rows_kept":1,"cut":false,"hidden":false,"merged":[[14,0,14,7],[26,0,26,7],[38,0,38,7],[1,0,1,7],[11,0,12,0],[11,1,12,1],[11,2,12,2],[11,3,12,3],[11,4,12,4],[11,5,12,5],[11,6,12,6]]}
["Mapa 4 : Priemerná ročná koncentrácia PM2.5  v roku 2024 – modelované hodnoty"]

{"sheet":"M1","index":57,"n_rows":1,"n_cols":1,"rows_kept":1,"cut":false,"hidden":false,"merged":[[14,0,14,7],[26,0,26,7],[38,0,38,7],[1,0,1,7],[11,0,12,0],[11,1,12,1],[11,2,12,2],[11,3,12,3],[11,4,12,4],[11,5,12,5],[11,6,12,6]]}
["Mapa 1: Výskyt jednodruhových porastov (2023)"]